{"text_format":"3","workbook":"xlsx","n_sheets":10,"sheets":["Übersicht","Verfügbarkeit","Gantt-Erzeugen","Arbeitsplan","KPI","Projekt_1","Projekt_2","Projekt_3","Projekt_4","Leer"],"not_rendered":{"charts":6,"macros":1,"external_links":2,"defined_names":14,"comments":1},"read":"whole","date_system":"1900"}

{"sheet":"Übersicht","index":0,"n_rows":31,"n_cols":28,"rows_kept":31}
[null,"Register nummer","Projekt","Modus","Start","Konzept","Entwicklung","Fertig","Pflege","SORT",{"$nulls":17},"Modi"]
[null,6,{"$f":"HYPERLINK(CONCATENATE(\"#\",MID(INDEX(xmap,B2),FIND(\"]\",INDEX(xmap,B2))+1,31),\"!A1\"),MID(INDEX(xmap,B2),FIND(\"]\",INDEX(xmap,B2))+1,31))","v":"Projekt_1"},"Fast","2013-07-01",{"$f":"IF(B2>0,VLOOKUP(D2,INDIRECT(\"'\"&$C2&\"'!A9:E11\"),2,0)*30+E2,\"\")","v":"2013-08-30"},{"$f":"IF(B2>0,VLOOKUP(D2,INDIRECT(\"'\"&$C2&\"'!A9:E11\"),3,0)*30+F2,\"\")","v":"2013-10-29"},{"$f":"IF(B2>0,VLOOKUP($D2,INDIRECT(\"'\"&$C2&\"'!A9:E11\"),4,0)*30+G2,\"\")","v":"2013-12-28"},{"$f":"IF(B2>0,VLOOKUP($D2,INDIRECT(\"'\"&$C2&\"'!A9:E11\"),5,0)*30+H2,\"\")","v":"2014-02-26"},1,{"$nulls":17},"Fast"]
[null,7,{"$f":"HYPERLINK(CONCATENATE(\"#\",MID(INDEX(xmap,B3),FIND(\"]\",INDEX(xmap,B3))+1,31),\"!A1\"),MID(INDEX(xmap,B3),FIND(\"]\",INDEX(xmap,B3))+1,31))","v":"Projekt_2"},"Medium","2013-08-01","2013-10-07T12:00:00","2013-12-14","2014-02-19T12:00:00","2014-04-28",2,{"$nulls":17},"Medium"]
[null,8,{"$f":"HYPERLINK(CONCATENATE(\"#\",MID(INDEX(xmap,B4),FIND(\"]\",INDEX(xmap,B4))+1,31),\"!A1\"),MID(INDEX(xmap,B4),FIND(\"]\",INDEX(xmap,B4))+1,31))","v":"Projekt_3"},"Slow","2013-09-01","2013-11-15","2014-01-29","2014-04-14","2014-06-28",3,{"$nulls":17},"Slow"]
[null,9,{"$f":"HYPERLINK(CONCATENATE(\"#\",MID(INDEX(xmap,B5),FIND(\"]\",INDEX(xmap,B5))+1,31),\"!A1\"),MID(INDEX(xmap,B5),FIND(\"]\",INDEX(xmap,B5))+1,31))","v":"Projekt_4"},"Exclude","2013-10-01",{"$error":"#N/A"},{"$error":"#N/A"},{"$error":"#N/A"},{"$error":"#N/A"},4,{"$nulls":17},"Exclude"]
[null,10,{"$f":"HYPERLINK(CONCATENATE(\"#\",MID(INDEX(xmap,B6),FIND(\"]\",INDEX(xmap,B6))+1,31),\"!A1\"),MID(INDEX(xmap,B6),FIND(\"]\",INDEX(xmap,B6))+1,31))","v":"Leer"},"Exclude",null,{"$error":"#N/A"},{"$error":"#N/A"},{"$error":"#N/A"},{"$error":"#N/A"},5]
[null,10,{"$f":"HYPERLINK(CONCATENATE(\"#\",MID(INDEX(xmap,B7),FIND(\"]\",INDEX(xmap,B7))+1,31),\"!A1\"),MID(INDEX(xmap,B7),FIND(\"]\",INDEX(xmap,B7))+1,31))","v":"Leer"},"Exclude",null,{"$error":"#N/A"},{"$error":"#N/A"},{"$error":"#N/A"},{"$error":"#N/A"},6]
[null,10,{"$f":"HYPERLINK(CONCATENATE(\"#\",MID(INDEX(xmap,B8),FIND(\"]\",INDEX(xmap,B8))+1,31),\"!A1\"),MID(INDEX(xmap,B8),FIND(\"]\",INDEX(xmap,B8))+1,31))","v":"Leer"},"Exclude",null,{"$error":"#N/A"},{"$error":"#N/A"},{"$error":"#N/A"},{"$error":"#N/A"},7]
[null,10,{"$f":"HYPERLINK(CONCATENATE(\"#\",MID(INDEX(xmap,B9),FIND(\"]\",INDEX(xmap,B9))+1,31),\"!A1\"),MID(INDEX(xmap,B9),FIND(\"]\",INDEX(xmap,B9))+1,31))","v":"Leer"},"Exclude",null,{"$error":"#N/A"},{"$error":"#N/A"},{"$error":"#N/A"},{"$error":"#N/A"},8]
[null,10,{"$f":"HYPERLINK(CONCATENATE(\"#\",MID(INDEX(xmap,B10),FIND(\"]\",INDEX(xmap,B10))+1,31),\"!A1\"),MID(INDEX(xmap,B10),FIND(\"]\",INDEX(xmap,B10))+1,31))","v":"Leer"},"Exclude",null,{"$error":"#N/A"},{"$error":"#N/A"},{"$error":"#N/A"},{"$error":"#N/A"},9]
[null,10,{"$f":"HYPERLINK(CONCATENATE(\"#\",MID(INDEX(xmap,B11),FIND(\"]\",INDEX(xmap,B11))+1,31),\"!A1\"),MID(INDEX(xmap,B11),FIND(\"]\",INDEX(xmap,B11))+1,31))","v":"Leer"},"Exclude",null,{"$error":"#N/A"},{"$error":"#N/A"},{"$error":"#N/A"},{"$error":"#N/A"},10]
[null,10,{"$f":"HYPERLINK(CONCATENATE(\"#\",MID(INDEX(xmap,B12),FIND(\"]\",INDEX(xmap,B12))+1,31),\"!A1\"),MID(INDEX(xmap,B12),FIND(\"]\",INDEX(xmap,B12))+1,31))","v":"Leer"},"Exclude",null,{"$error":"#N/A"},{"$error":"#N/A"},{"$error":"#N/A"},{"$error":"#N/A"},11]
[null,10,{"$f":"HYPERLINK(CONCATENATE(\"#\",MID(INDEX(xmap,B13),FIND(\"]\",INDEX(xmap,B13))+1,31),\"!A1\"),MID(INDEX(xmap,B13),FIND(\"]\",INDEX(xmap,B13))+1,31))","v":"Leer"},"Exclude",null,{"$error":"#N/A"},{"$error":"#N/A"},{"$error":"#N/A"},{"$error":"#N/A"},12]
[null,10,{"$f":"HYPERLINK(CONCATENATE(\"#\",MID(INDEX(xmap,B14),FIND(\"]\",INDEX(xmap,B14))+1,31),\"!A1\"),MID(INDEX(xmap,B14),FIND(\"]\",INDEX(xmap,B14))+1,31))","v":"Leer"},"Exclude",null,{"$error":"#N/A"},{"$error":"#N/A"},{"$error":"#N/A"},{"$error":"#N/A"},13]
[null,10,{"$f":"HYPERLINK(CONCATENATE(\"#\",MID(INDEX(xmap,B15),FIND(\"]\",INDEX(xmap,B15))+1,31),\"!A1\"),MID(INDEX(xmap,B15),FIND(\"]\",INDEX(xmap,B15))+1,31))","v":"Leer"},"Exclude",null,{"$error":"#N/A"},{"$error":"#N/A"},{"$error":"#N/A"},{"$error":"#N/A"},14]
[null,10,{"$f":"HYPERLINK(CONCATENATE(\"#\",MID(INDEX(xmap,B16),FIND(\"]\",INDEX(xmap,B16))+1,31),\"!A1\"),MID(INDEX(xmap,B16),FIND(\"]\",INDEX(xmap,B16))+1,31))","v":"Leer"},"Exclude",null,{"$error":"#N/A"},{"$error":"#N/A"},{"$error":"#N/A"},{"$error":"#N/A"},15]
[null,10,{"$f":"HYPERLINK(CONCATENATE(\"#\",MID(INDEX(xmap,B17),FIND(\"]\",INDEX(xmap,B17))+1,31),\"!A1\"),MID(INDEX(xmap,B17),FIND(\"]\",INDEX(xmap,B17))+1,31))","v":"Leer"},"Exclude",null,{"$error":"#N/A"},{"$error":"#N/A"},{"$error":"#N/A"},{"$error":"#N/A"},16]
[null,10,{"$f":"HYPERLINK(CONCATENATE(\"#\",MID(INDEX(xmap,B18),FIND(\"]\",INDEX(xmap,B18))+1,31),\"!A1\"),MID(INDEX(xmap,B18),FIND(\"]\",INDEX(xmap,B18))+1,31))","v":"Leer"},"Exclude",null,{"$error":"#N/A"},{"$error":"#N/A"},{"$error":"#N/A"},{"$error":"#N/A"},17]
[null,10,{"$f":"HYPERLINK(CONCATENATE(\"#\",MID(INDEX(xmap,B19),FIND(\"]\",INDEX(xmap,B19))+1,31),\"!A1\"),MID(INDEX(xmap,B19),FIND(\"]\",INDEX(xmap,B19))+1,31))","v":"Leer"},"Exclude",null,{"$error":"#N/A"},{"$error":"#N/A"},{"$error":"#N/A"},{"$error":"#N/A"},18]
[null,10,{"$f":"HYPERLINK(CONCATENATE(\"#\",MID(INDEX(xmap,B20),FIND(\"]\",INDEX(xmap,B20))+1,31),\"!A1\"),MID(INDEX(xmap,B20),FIND(\"]\",INDEX(xmap,B20))+1,31))","v":"Leer"},"Exclude",null,{"$error":"#N/A"},{"$error":"#N/A"},{"$error":"#N/A"},{"$error":"#N/A"},19]
[null,10,{"$f":"HYPERLINK(CONCATENATE(\"#\",MID(INDEX(xmap,B21),FIND(\"]\",INDEX(xmap,B21))+1,31),\"!A1\"),MID(INDEX(xmap,B21),FIND(\"]\",INDEX(xmap,B21))+1,31))","v":"Leer"},"Exclude",null,{"$error":"#N/A"},{"$error":"#N/A"},{"$error":"#N/A"},{"$error":"#N/A"},20]
[null,10,{"$f":"HYPERLINK(CONCATENATE(\"#\",MID(INDEX(xmap,B22),FIND(\"]\",INDEX(xmap,B22))+1,31),\"!A1\"),MID(INDEX(xmap,B22),FIND(\"]\",INDEX(xmap,B22))+1,31))","v":"Leer"},"Exclude",null,{"$error":"#N/A"},{"$error":"#N/A"},{"$error":"#N/A"},{"$error":"#N/A"},21]
[null,10,{"$f":"HYPERLINK(CONCATENATE(\"#\",MID(INDEX(xmap,B23),FIND(\"]\",INDEX(xmap,B23))+1,31),\"!A1\"),MID(INDEX(xmap,B23),FIND(\"]\",INDEX(xmap,B23))+1,31))","v":"Leer"},"Exclude",null,{"$error":"#N/A"},{"$error":"#N/A"},{"$error":"#N/A"},{"$error":"#N/A"},22]
[null,10,{"$f":"HYPERLINK(CONCATENATE(\"#\",MID(INDEX(xmap,B24),FIND(\"]\",INDEX(xmap,B24))+1,31),\"!A1\"),MID(INDEX(xmap,B24),FIND(\"]\",INDEX(xmap,B24))+1,31))","v":"Leer"},"Exclude",null,{"$error":"#N/A"},{"$error":"#N/A"},{"$error":"#N/A"},{"$error":"#N/A"},23]
[null,10,{"$f":"HYPERLINK(CONCATENATE(\"#\",MID(INDEX(xmap,B25),FIND(\"]\",INDEX(xmap,B25))+1,31),\"!A1\"),MID(INDEX(xmap,B25),FIND(\"]\",INDEX(xmap,B25))+1,31))","v":"Leer"},"Exclude",null,{"$error":"#N/A"},{"$error":"#N/A"},{"$error":"#N/A"},{"$error":"#N/A"},24]
[null,10,{"$f":"HYPERLINK(CONCATENATE(\"#\",MID(INDEX(xmap,B26),FIND(\"]\",INDEX(xmap,B26))+1,31),\"!A1\"),MID(INDEX(xmap,B26),FIND(\"]\",INDEX(xmap,B26))+1,31))","v":"Leer"},"Exclude",null,{"$error":"#N/A"},{"$error":"#N/A"},{"$error":"#N/A"},{"$error":"#N/A"},25]
[null,10,{"$f":"HYPERLINK(CONCATENATE(\"#\",MID(INDEX(xmap,B27),FIND(\"]\",INDEX(xmap,B27))+1,31),\"!A1\"),MID(INDEX(xmap,B27),FIND(\"]\",INDEX(xmap,B27))+1,31))","v":"Leer"},"Exclude",null,{"$error":"#N/A"},{"$error":"#N/A"},{"$error":"#N/A"},{"$error":"#N/A"},26]
[null,10,{"$f":"HYPERLINK(CONCATENATE(\"#\",MID(INDEX(xmap,B28),FIND(\"]\",INDEX(xmap,B28))+1,31),\"!A1\"),MID(INDEX(xmap,B28),FIND(\"]\",INDEX(xmap,B28))+1,31))","v":"Leer"},"Exclude",null,{"$error":"#N/A"},{"$error":"#N/A"},{"$error":"#N/A"},{"$error":"#N/A"},27]
[null,10,{"$f":"HYPERLINK(CONCATENATE(\"#\",MID(INDEX(xmap,B29),FIND(\"]\",INDEX(xmap,B29))+1,31),\"!A1\"),MID(INDEX(xmap,B29),FIND(\"]\",INDEX(xmap,B29))+1,31))","v":"Leer"},"Exclude",null,{"$error":"#N/A"},{"$error":"#N/A"},{"$error":"#N/A"},{"$error":"#N/A"},28]
[null,10,{"$f":"HYPERLINK(CONCATENATE(\"#\",MID(INDEX(xmap,B30),FIND(\"]\",INDEX(xmap,B30))+1,31),\"!A1\"),MID(INDEX(xmap,B30),FIND(\"]\",INDEX(xmap,B30))+1,31))","v":"Leer"},"Exclude",null,{"$error":"#N/A"},{"$error":"#N/A"},{"$error":"#N/A"},{"$error":"#N/A"},29]
[null,10,{"$f":"HYPERLINK(CONCATENATE(\"#\",MID(INDEX(xmap,B31),FIND(\"]\",INDEX(xmap,B31))+1,31),\"!A1\"),MID(INDEX(xmap,B31),FIND(\"]\",INDEX(xmap,B31))+1,31))","v":"Leer"},"Exclude",null,{"$error":"#N/A"},{"$error":"#N/A"},{"$error":"#N/A"},{"$error":"#N/A"},30]

{"sheet":"Verfügbarkeit","index":1,"n_rows":4,"n_cols":21,"rows_kept":4}
["Übertrag der Verfügbarkeit"]
[]
[{"$f":"Arbeitsplan!P3","v":"KW 14"},{"$f":"Arbeitsplan!Q3","v":"KW 18"},{"$f":"Arbeitsplan!R3","v":"KW 23"},{"$f":"Arbeitsplan!S3","v":"KW 27"},{"$f":"Arbeitsplan!T3","v":"KW 32"},{"$f":"Arbeitsplan!U3","v":"KW 36"},{"$f":"Arbeitsplan!V3","v":"KW 40"},{"$f":"Arbeitsplan!W3","v":"KW 45"},{"$f":"Arbeitsplan!X3","v":"KW 49"},{"$f":"Arbeitsplan!Y3","v":"KW 1"},{"$f":"Arbeitsplan!Z3","v":"KW 6"},{"$f":"Arbeitsplan!AA3","v":"KW 10"},{"$f":"Arbeitsplan!AB3","v":"KW 14"},{"$f":"Arbeitsplan!AC3","v":"KW 19"},{"$f":"Arbeitsplan!AD3","v":"KW 23"},{"$f":"Arbeitsplan!AE3","v":"KW 27"},{"$f":"Arbeitsplan!AF3","v":"KW 32"},{"$f":"Arbeitsplan!AG3","v":"KW 36"},{"$f":"Arbeitsplan!AH3","v":"KW 40"},{"$f":"Arbeitsplan!AI3","v":"KW 45"},{"$f":"Arbeitsplan!AJ3","v":"KW 49"}]
[150,150,150,150,150,150,150,150,150,150,150,150,150,150,150,150,150,150,150,150,150]

{"sheet":"Gantt-Erzeugen","index":2,"n_rows":561,"n_cols":5,"rows_kept":561,"merged":[[2,1,2,4],[3,2,3,4]]}
["Gantt-Diagramm"]
[]
[null,"Planned"]
[null,null,"Duration"]
["Task-Bezeichnung","Start","Level 1","Level 2","Level 3"]
[{"$f":"IF(C6<>\"\",Arbeitsplan!F12,\"\")","v":"Projekt_1"},{"$f":"IF(Arbeitsplan!F12<>\"\",Arbeitsplan!G12,\"\")","v":"2013-07-01"},{"$f":"IF(Arbeitsplan!A12<>\"\",IF(Arbeitsplan!H12<>\"\",Arbeitsplan!H12-Arbeitsplan!G12+1,\"\"),\"\")","v":181},{"$f":"IF(Arbeitsplan!B12<>\"\",IF(Arbeitsplan!H12<>\"\",Arbeitsplan!H12-Arbeitsplan!G12+1,\"\"),\"\")","v":""},{"$f":"IF(Arbeitsplan!C12<>\"\",IF(Arbeitsplan!H12<>\"\",Arbeitsplan!H12-Arbeitsplan!G12+1,\"\"),\"\")","v":""}]
[{"$f":"IF(C7<>\"\",Arbeitsplan!F13,\"\")","v":""},{"$f":"IF(Arbeitsplan!F13<>\"\",Arbeitsplan!G13,\"\")","v":"2013-07-01"},null,{"$f":"IF(Arbeitsplan!B13<>\"\",IF(Arbeitsplan!H13<>\"\",Arbeitsplan!H13-Arbeitsplan!G13+1,\"\"),\"\")","v":61},{"$f":"IF(Arbeitsplan!C13<>\"\",IF(Arbeitsplan!H13<>\"\",Arbeitsplan!H13-Arbeitsplan!G13+1,\"\"),\"\")","v":""}]
[{"$f":"IF(C8<>\"\",Arbeitsplan!F14,\"\")","v":""},{"$f":"IF(Arbeitsplan!F14<>\"\",Arbeitsplan!G14,\"\")","v":"2013-07-01"},null,null,{"$f":"IF(Arbeitsplan!C14<>\"\",IF(Arbeitsplan!H14<>\"\",Arbeitsplan!H14-Arbeitsplan!G14+1,\"\"),\"\")","v":61}]
[{"$f":"IF(C9<>\"\",Arbeitsplan!F15,\"\")","v":""},{"$f":"IF(Arbeitsplan!F15<>\"\",Arbeitsplan!G15,\"\")","v":"2013-07-01"},null,null,{"$f":"IF(Arbeitsplan!C15<>\"\",IF(Arbeitsplan!H15<>\"\",Arbeitsplan!H15-Arbeitsplan!G15+1,\"\"),\"\")","v":61}]
[{"$f":"IF(C10<>\"\",Arbeitsplan!F16,\"\")","v":""},{"$f":"IF(Arbeitsplan!F16<>\"\",Arbeitsplan!G16,\"\")","v":"2013-07-01"},null,null,{"$f":"IF(Arbeitsplan!C16<>\"\",IF(Arbeitsplan!H16<>\"\",Arbeitsplan!H16-Arbeitsplan!G16+1,\"\"),\"\")","v":61}]
[{"$f":"IF(C11<>\"\",Arbeitsplan!F17,\"\")","v":""},{"$f":"IF(Arbeitsplan!F17<>\"\",Arbeitsplan!G17,\"\")","v":""},{"$f":"IF(Arbeitsplan!A17<>\"\",IF(Arbeitsplan!H17<>\"\",Arbeitsplan!H17-Arbeitsplan!G17+1,\"\"),\"\")","v":""},{"$f":"IF(Arbeitsplan!B17<>\"\",IF(Arbeitsplan!H17<>\"\",Arbeitsplan!H17-Arbeitsplan!G17+1,\"\"),\"\")","v":""},{"$f":"IF(Arbeitsplan!C17<>\"\",IF(Arbeitsplan!H17<>\"\",Arbeitsplan!H17-Arbeitsplan!G17+1,\"\"),\"\")","v":""}]
[{"$f":"IF(C12<>\"\",Arbeitsplan!F18,\"\")","v":""},{"$f":"IF(Arbeitsplan!F18<>\"\",Arbeitsplan!G18,\"\")","v":"2013-08-30"},null,{"$f":"IF(Arbeitsplan!B18<>\"\",IF(Arbeitsplan!H18<>\"\",Arbeitsplan!H18-Arbeitsplan!G18+1,\"\"),\"\")","v":61},{"$f":"IF(Arbeitsplan!C18<>\"\",IF(Arbeitsplan!H18<>\"\",Arbeitsplan!H18-Arbeitsplan!G18+1,\"\"),\"\")","v":""}]
[{"$f":"IF(C13<>\"\",Arbeitsplan!F19,\"\")","v":""},{"$f":"IF(Arbeitsplan!F19<>\"\",Arbeitsplan!G19,\"\")","v":"2013-08-30"},null,null,{"$f":"IF(Arbeitsplan!C19<>\"\",IF(Arbeitsplan!H19<>\"\",Arbeitsplan!H19-Arbeitsplan!G19+1,\"\"),\"\")","v":61}]
[{"$f":"IF(C14<>\"\",Arbeitsplan!F20,\"\")","v":""},{"$f":"IF(Arbeitsplan!F20<>\"\",Arbeitsplan!G20,\"\")","v":"2013-08-30"},null,null,{"$f":"IF(Arbeitsplan!C20<>\"\",IF(Arbeitsplan!H20<>\"\",Arbeitsplan!H20-Arbeitsplan!G20+1,\"\"),\"\")","v":61}]
[{"$f":"IF(C15<>\"\",Arbeitsplan!F21,\"\")","v":""},{"$f":"IF(Arbeitsplan!F21<>\"\",Arbeitsplan!G21,\"\")","v":"2013-08-30"},null,null,{"$f":"IF(Arbeitsplan!C21<>\"\",IF(Arbeitsplan!H21<>\"\",Arbeitsplan!H21-Arbeitsplan!G21+1,\"\"),\"\")","v":61}]
[{"$f":"IF(C16<>\"\",Arbeitsplan!F22,\"\")","v":""},{"$f":"IF(Arbeitsplan!F22<>\"\",Arbeitsplan!G22,\"\")","v":""},{"$f":"IF(Arbeitsplan!A22<>\"\",IF(Arbeitsplan!H22<>\"\",Arbeitsplan!H22-Arbeitsplan!G22+1,\"\"),\"\")","v":""},{"$f":"IF(Arbeitsplan!B22<>\"\",IF(Arbeitsplan!H22<>\"\",Arbeitsplan!H22-Arbeitsplan!G22+1,\"\"),\"\")","v":""},{"$f":"IF(Arbeitsplan!C22<>\"\",IF(Arbeitsplan!H22<>\"\",Arbeitsplan!H22-Arbeitsplan!G22+1,\"\"),\"\")","v":""}]
[{"$f":"IF(C17<>\"\",Arbeitsplan!F23,\"\")","v":""},{"$f":"IF(Arbeitsplan!F23<>\"\",Arbeitsplan!G23,\"\")","v":"2013-10-29"},null,{"$f":"IF(Arbeitsplan!B23<>\"\",IF(Arbeitsplan!H23<>\"\",Arbeitsplan!H23-Arbeitsplan!G23+1,\"\"),\"\")","v":61},{"$f":"IF(Arbeitsplan!C23<>\"\",IF(Arbeitsplan!H23<>\"\",Arbeitsplan!H23-Arbeitsplan!G23+1,\"\"),\"\")","v":""}]
[{"$f":"IF(C18<>\"\",Arbeitsplan!F24,\"\")","v":""},{"$f":"IF(Arbeitsplan!F24<>\"\",Arbeitsplan!G24,\"\")","v":"2013-10-29"},null,null,{"$f":"IF(Arbeitsplan!C24<>\"\",IF(Arbeitsplan!H24<>\"\",Arbeitsplan!H24-Arbeitsplan!G24+1,\"\"),\"\")","v":61}]
[{"$f":"IF(C19<>\"\",Arbeitsplan!F25,\"\")","v":""},{"$f":"IF(Arbeitsplan!F25<>\"\",Arbeitsplan!G25,\"\")","v":"2013-10-29"},null,null,{"$f":"IF(Arbeitsplan!C25<>\"\",IF(Arbeitsplan!H25<>\"\",Arbeitsplan!H25-Arbeitsplan!G25+1,\"\"),\"\")","v":61}]
[{"$f":"IF(C20<>\"\",Arbeitsplan!F26,\"\")","v":""},{"$f":"IF(Arbeitsplan!F26<>\"\",Arbeitsplan!G26,\"\")","v":"2013-10-29"},null,null,{"$f":"IF(Arbeitsplan!C26<>\"\",IF(Arbeitsplan!H26<>\"\",Arbeitsplan!H26-Arbeitsplan!G26+1,\"\"),\"\")","v":61}]
[{"$f":"IF(C21<>\"\",Arbeitsplan!F27,\"\")","v":""},{"$f":"IF(Arbeitsplan!F27<>\"\",Arbeitsplan!G27,\"\")","v":""},{"$f":"IF(Arbeitsplan!A27<>\"\",IF(Arbeitsplan!H27<>\"\",Arbeitsplan!H27-Arbeitsplan!G27+1,\"\"),\"\")","v":""},{"$f":"IF(Arbeitsplan!B27<>\"\",IF(Arbeitsplan!H27<>\"\",Arbeitsplan!H27-Arbeitsplan!G27+1,\"\"),\"\")","v":""},{"$f":"IF(Arbeitsplan!C27<>\"\",IF(Arbeitsplan!H27<>\"\",Arbeitsplan!H27-Arbeitsplan!G27+1,\"\"),\"\")","v":""}]
[{"$f":"IF(C22<>\"\",Arbeitsplan!F28,\"\")","v":""},{"$f":"IF(Arbeitsplan!F28<>\"\",Arbeitsplan!G28,\"\")","v":"2013-12-28"},null,{"$f":"IF(Arbeitsplan!B28<>\"\",IF(Arbeitsplan!H28<>\"\",Arbeitsplan!H28-Arbeitsplan!G28+1,\"\"),\"\")","v":61},{"$f":"IF(Arbeitsplan!C28<>\"\",IF(Arbeitsplan!H28<>\"\",Arbeitsplan!H28-Arbeitsplan!G28+1,\"\"),\"\")","v":""}]
[{"$f":"IF(C23<>\"\",Arbeitsplan!F29,\"\")","v":""},{"$f":"IF(Arbeitsplan!F29<>\"\",Arbeitsplan!G29,\"\")","v":"2013-12-28"},null,null,{"$f":"IF(Arbeitsplan!C29<>\"\",IF(Arbeitsplan!H29<>\"\",Arbeitsplan!H29-Arbeitsplan!G29+1,\"\"),\"\")","v":61}]
[{"$f":"IF(C24<>\"\",Arbeitsplan!F30,\"\")","v":""},{"$f":"IF(Arbeitsplan!F30<>\"\",Arbeitsplan!G30,\"\")","v":"2013-12-28"},null,null,{"$f":"IF(Arbeitsplan!C30<>\"\",IF(Arbeitsplan!H30<>\"\",Arbeitsplan!H30-Arbeitsplan!G30+1,\"\"),\"\")","v":61}]
[{"$f":"IF(C25<>\"\",Arbeitsplan!F31,\"\")","v":""},{"$f":"IF(Arbeitsplan!F31<>\"\",Arbeitsplan!G31,\"\")","v":"2013-12-28"},null,null,{"$f":"IF(Arbeitsplan!C31<>\"\",IF(Arbeitsplan!H31<>\"\",Arbeitsplan!H31-Arbeitsplan!G31+1,\"\"),\"\")","v":61}]
[{"$f":"IF(C26<>\"\",Arbeitsplan!F32,\"\")","v":""},{"$f":"IF(Arbeitsplan!F32<>\"\",Arbeitsplan!G32,\"\")","v":""},{"$f":"IF(Arbeitsplan!A32<>\"\",IF(Arbeitsplan!H32<>\"\",Arbeitsplan!H32-Arbeitsplan!G32+1,\"\"),\"\")","v":""},{"$f":"IF(Arbeitsplan!B32<>\"\",IF(Arbeitsplan!H32<>\"\",Arbeitsplan!H32-Arbeitsplan!G32+1,\"\"),\"\")","v":""},{"$f":"IF(Arbeitsplan!C32<>\"\",IF(Arbeitsplan!H32<>\"\",Arbeitsplan!H32-Arbeitsplan!G32+1,\"\"),\"\")","v":""}]
[{"$f":"IF(C27<>\"\",Arbeitsplan!F33,\"\")","v":""},{"$f":"IF(Arbeitsplan!F33<>\"\",Arbeitsplan!G33,\"\")","v":""},{"$f":"IF(Arbeitsplan!A33<>\"\",IF(Arbeitsplan!H33<>\"\",Arbeitsplan!H33-Arbeitsplan!G33+1,\"\"),\"\")","v":""},{"$f":"IF(Arbeitsplan!B33<>\"\",IF(Arbeitsplan!H33<>\"\",Arbeitsplan!H33-Arbeitsplan!G33+1,\"\"),\"\")","v":""},{"$f":"IF(Arbeitsplan!C33<>\"\",IF(Arbeitsplan!H33<>\"\",Arbeitsplan!H33-Arbeitsplan!G33+1,\"\"),\"\")","v":""}]
[{"$f":"IF(C28<>\"\",Arbeitsplan!F34,\"\")","v":"Projekt_2"},{"$f":"IF(Arbeitsplan!F34<>\"\",Arbeitsplan!G34,\"\")","v":"2013-08-01"},{"$f":"IF(Arbeitsplan!A34<>\"\",IF(Arbeitsplan!H34<>\"\",Arbeitsplan!H34-Arbeitsplan!G34+1,\"\"),\"\")","v":203.5},{"$f":"IF(Arbeitsplan!B34<>\"\",IF(Arbeitsplan!H34<>\"\",Arbeitsplan!H34-Arbeitsplan!G34+1,\"\"),\"\")","v":""},{"$f":"IF(Arbeitsplan!C34<>\"\",IF(Arbeitsplan!H34<>\"\",Arbeitsplan!H34-Arbeitsplan!G34+1,\"\"),\"\")","v":""}]
[{"$f":"IF(C29<>\"\",Arbeitsplan!F35,\"\")","v":""},{"$f":"IF(Arbeitsplan!F35<>\"\",Arbeitsplan!G35,\"\")","v":"2013-08-01"},null,{"$f":"IF(Arbeitsplan!B35<>\"\",IF(Arbeitsplan!H35<>\"\",Arbeitsplan!H35-Arbeitsplan!G35+1,\"\"),\"\")","v":68.5},{"$f":"IF(Arbeitsplan!C35<>\"\",IF(Arbeitsplan!H35<>\"\",Arbeitsplan!H35-Arbeitsplan!G35+1,\"\"),\"\")","v":""}]
[{"$f":"IF(C30<>\"\",Arbeitsplan!F36,\"\")","v":""},{"$f":"IF(Arbeitsplan!F36<>\"\",Arbeitsplan!G36,\"\")","v":"2013-08-01"},null,null,{"$f":"IF(Arbeitsplan!C36<>\"\",IF(Arbeitsplan!H36<>\"\",Arbeitsplan!H36-Arbeitsplan!G36+1,\"\"),\"\")","v":68.5}]
[{"$f":"IF(C31<>\"\",Arbeitsplan!F37,\"\")","v":""},{"$f":"IF(Arbeitsplan!F37<>\"\",Arbeitsplan!G37,\"\")","v":"2013-08-01"},null,null,{"$f":"IF(Arbeitsplan!C37<>\"\",IF(Arbeitsplan!H37<>\"\",Arbeitsplan!H37-Arbeitsplan!G37+1,\"\"),\"\")","v":68.5}]
[{"$f":"IF(C32<>\"\",Arbeitsplan!F38,\"\")","v":""},{"$f":"IF(Arbeitsplan!F38<>\"\",Arbeitsplan!G38,\"\")","v":"2013-08-01"},null,null,{"$f":"IF(Arbeitsplan!C38<>\"\",IF(Arbeitsplan!H38<>\"\",Arbeitsplan!H38-Arbeitsplan!G38+1,\"\"),\"\")","v":68.5}]
[{"$f":"IF(C33<>\"\",Arbeitsplan!F39,\"\")","v":""},{"$f":"IF(Arbeitsplan!F39<>\"\",Arbeitsplan!G39,\"\")","v":""},{"$f":"IF(Arbeitsplan!A39<>\"\",IF(Arbeitsplan!H39<>\"\",Arbeitsplan!H39-Arbeitsplan!G39+1,\"\"),\"\")","v":""},{"$f":"IF(Arbeitsplan!B39<>\"\",IF(Arbeitsplan!H39<>\"\",Arbeitsplan!H39-Arbeitsplan!G39+1,\"\"),\"\")","v":""},{"$f":"IF(Arbeitsplan!C39<>\"\",IF(Arbeitsplan!H39<>\"\",Arbeitsplan!H39-Arbeitsplan!G39+1,\"\"),\"\")","v":""}]
[{"$f":"IF(C34<>\"\",Arbeitsplan!F40,\"\")","v":""},{"$f":"IF(Arbeitsplan!F40<>\"\",Arbeitsplan!G40,\"\")","v":"2013-10-07T12:00:00"},null,{"$f":"IF(Arbeitsplan!B40<>\"\",IF(Arbeitsplan!H40<>\"\",Arbeitsplan!H40-Arbeitsplan!G40+1,\"\"),\"\")","v":68.5},{"$f":"IF(Arbeitsplan!C40<>\"\",IF(Arbeitsplan!H40<>\"\",Arbeitsplan!H40-Arbeitsplan!G40+1,\"\"),\"\")","v":""}]
[{"$f":"IF(C35<>\"\",Arbeitsplan!F41,\"\")","v":""},{"$f":"IF(Arbeitsplan!F41<>\"\",Arbeitsplan!G41,\"\")","v":"2013-10-07T12:00:00"},null,null,{"$f":"IF(Arbeitsplan!C41<>\"\",IF(Arbeitsplan!H41<>\"\",Arbeitsplan!H41-Arbeitsplan!G41+1,\"\"),\"\")","v":68.5}]
[{"$f":"IF(C36<>\"\",Arbeitsplan!F42,\"\")","v":""},{"$f":"IF(Arbeitsplan!F42<>\"\",Arbeitsplan!G42,\"\")","v":"2013-10-07T12:00:00"},null,null,{"$f":"IF(Arbeitsplan!C42<>\"\",IF(Arbeitsplan!H42<>\"\",Arbeitsplan!H42-Arbeitsplan!G42+1,\"\"),\"\")","v":68.5}]
[{"$f":"IF(C37<>\"\",Arbeitsplan!F43,\"\")","v":""},{"$f":"IF(Arbeitsplan!F43<>\"\",Arbeitsplan!G43,\"\")","v":"2013-10-07T12:00:00"},null,null,{"$f":"IF(Arbeitsplan!C43<>\"\",IF(Arbeitsplan!H43<>\"\",Arbeitsplan!H43-Arbeitsplan!G43+1,\"\"),\"\")","v":68.5}]
[{"$f":"IF(C38<>\"\",Arbeitsplan!F44,\"\")","v":""},{"$f":"IF(Arbeitsplan!F44<>\"\",Arbeitsplan!G44,\"\")","v":""},{"$f":"IF(Arbeitsplan!A44<>\"\",IF(Arbeitsplan!H44<>\"\",Arbeitsplan!H44-Arbeitsplan!G44+1,\"\"),\"\")","v":""},{"$f":"IF(Arbeitsplan!B44<>\"\",IF(Arbeitsplan!H44<>\"\",Arbeitsplan!H44-Arbeitsplan!G44+1,\"\"),\"\")","v":""},{"$f":"IF(Arbeitsplan!C44<>\"\",IF(Arbeitsplan!H44<>\"\",Arbeitsplan!H44-Arbeitsplan!G44+1,\"\"),\"\")","v":""}]
[{"$f":"IF(C39<>\"\",Arbeitsplan!F45,\"\")","v":""},{"$f":"IF(Arbeitsplan!F45<>\"\",Arbeitsplan!G45,\"\")","v":"2013-12-14"},null,{"$f":"IF(Arbeitsplan!B45<>\"\",IF(Arbeitsplan!H45<>\"\",Arbeitsplan!H45-Arbeitsplan!G45+1,\"\"),\"\")","v":68.5},{"$f":"IF(Arbeitsplan!C45<>\"\",IF(Arbeitsplan!H45<>\"\",Arbeitsplan!H45-Arbeitsplan!G45+1,\"\"),\"\")","v":""}]
[{"$f":"IF(C40<>\"\",Arbeitsplan!F46,\"\")","v":""},{"$f":"IF(Arbeitsplan!F46<>\"\",Arbeitsplan!G46,\"\")","v":"2013-12-14"},null,null,{"$f":"IF(Arbeitsplan!C46<>\"\",IF(Arbeitsplan!H46<>\"\",Arbeitsplan!H46-Arbeitsplan!G46+1,\"\"),\"\")","v":68.5}]
[{"$f":"IF(C41<>\"\",Arbeitsplan!F47,\"\")","v":""},{"$f":"IF(Arbeitsplan!F47<>\"\",Arbeitsplan!G47,\"\")","v":"2013-12-14"},null,null,{"$f":"IF(Arbeitsplan!C47<>\"\",IF(Arbeitsplan!H47<>\"\",Arbeitsplan!H47-Arbeitsplan!G47+1,\"\"),\"\")","v":68.5}]
[{"$f":"IF(C42<>\"\",Arbeitsplan!F48,\"\")","v":""},{"$f":"IF(Arbeitsplan!F48<>\"\",Arbeitsplan!G48,\"\")","v":"2013-12-14"},null,null,{"$f":"IF(Arbeitsplan!C48<>\"\",IF(Arbeitsplan!H48<>\"\",Arbeitsplan!H48-Arbeitsplan!G48+1,\"\"),\"\")","v":68.5}]
[{"$f":"IF(C43<>\"\",Arbeitsplan!F49,\"\")","v":""},{"$f":"IF(Arbeitsplan!F49<>\"\",Arbeitsplan!G49,\"\")","v":""},{"$f":"IF(Arbeitsplan!A49<>\"\",IF(Arbeitsplan!H49<>\"\",Arbeitsplan!H49-Arbeitsplan!G49+1,\"\"),\"\")","v":""},{"$f":"IF(Arbeitsplan!B49<>\"\",IF(Arbeitsplan!H49<>\"\",Arbeitsplan!H49-Arbeitsplan!G49+1,\"\"),\"\")","v":""},{"$f":"IF(Arbeitsplan!C49<>\"\",IF(Arbeitsplan!H49<>\"\",Arbeitsplan!H49-Arbeitsplan!G49+1,\"\"),\"\")","v":""}]
[{"$f":"IF(C44<>\"\",Arbeitsplan!F50,\"\")","v":""},{"$f":"IF(Arbeitsplan!F50<>\"\",Arbeitsplan!G50,\"\")","v":"2014-02-19T12:00:00"},null,{"$f":"IF(Arbeitsplan!B50<>\"\",IF(Arbeitsplan!H50<>\"\",Arbeitsplan!H50-Arbeitsplan!G50+1,\"\"),\"\")","v":68.5},{"$f":"IF(Arbeitsplan!C50<>\"\",IF(Arbeitsplan!H50<>\"\",Arbeitsplan!H50-Arbeitsplan!G50+1,\"\"),\"\")","v":""}]
[{"$f":"IF(C45<>\"\",Arbeitsplan!F51,\"\")","v":""},{"$f":"IF(Arbeitsplan!F51<>\"\",Arbeitsplan!G51,\"\")","v":"2014-02-19T12:00:00"},null,null,{"$f":"IF(Arbeitsplan!C51<>\"\",IF(Arbeitsplan!H51<>\"\",Arbeitsplan!H51-Arbeitsplan!G51+1,\"\"),\"\")","v":68.5}]
[{"$f":"IF(C46<>\"\",Arbeitsplan!F52,\"\")","v":""},{"$f":"IF(Arbeitsplan!F52<>\"\",Arbeitsplan!G52,\"\")","v":"2014-02-19T12:00:00"},null,null,{"$f":"IF(Arbeitsplan!C52<>\"\",IF(Arbeitsplan!H52<>\"\",Arbeitsplan!H52-Arbeitsplan!G52+1,\"\"),\"\")","v":68.5}]
[{"$f":"IF(C47<>\"\",Arbeitsplan!F53,\"\")","v":""},{"$f":"IF(Arbeitsplan!F53<>\"\",Arbeitsplan!G53,\"\")","v":"2014-02-19T12:00:00"},null,null,{"$f":"IF(Arbeitsplan!C53<>\"\",IF(Arbeitsplan!H53<>\"\",Arbeitsplan!H53-Arbeitsplan!G53+1,\"\"),\"\")","v":68.5}]
[{"$f":"IF(C48<>\"\",Arbeitsplan!F54,\"\")","v":""},{"$f":"IF(Arbeitsplan!F54<>\"\",Arbeitsplan!G54,\"\")","v":""},{"$f":"IF(Arbeitsplan!A54<>\"\",IF(Arbeitsplan!H54<>\"\",Arbeitsplan!H54-Arbeitsplan!G54+1,\"\"),\"\")","v":""},{"$f":"IF(Arbeitsplan!B54<>\"\",IF(Arbeitsplan!H54<>\"\",Arbeitsplan!H54-Arbeitsplan!G54+1,\"\"),\"\")","v":""},{"$f":"IF(Arbeitsplan!C54<>\"\",IF(Arbeitsplan!H54<>\"\",Arbeitsplan!H54-Arbeitsplan!G54+1,\"\"),\"\")","v":""}]
[{"$f":"IF(C49<>\"\",Arbeitsplan!F55,\"\")","v":""},{"$f":"IF(Arbeitsplan!F55<>\"\",Arbeitsplan!G55,\"\")","v":""},{"$f":"IF(Arbeitsplan!A55<>\"\",IF(Arbeitsplan!H55<>\"\",Arbeitsplan!H55-Arbeitsplan!G55+1,\"\"),\"\")","v":""},{"$f":"IF(Arbeitsplan!B55<>\"\",IF(Arbeitsplan!H55<>\"\",Arbeitsplan!H55-Arbeitsplan!G55+1,\"\"),\"\")","v":""},{"$f":"IF(Arbeitsplan!C55<>\"\",IF(Arbeitsplan!H55<>\"\",Arbeitsplan!H55-Arbeitsplan!G55+1,\"\"),\"\")","v":""}]
[{"$f":"IF(C50<>\"\",Arbeitsplan!F56,\"\")","v":"Projekt_3"},{"$f":"IF(Arbeitsplan!F56<>\"\",Arbeitsplan!G56,\"\")","v":"2013-09-01"},{"$f":"IF(Arbeitsplan!A56<>\"\",IF(Arbeitsplan!H56<>\"\",Arbeitsplan!H56-Arbeitsplan!G56+1,\"\"),\"\")","v":226},{"$f":"IF(Arbeitsplan!B56<>\"\",IF(Arbeitsplan!H56<>\"\",Arbeitsplan!H56-Arbeitsplan!G56+1,\"\"),\"\")","v":""},{"$f":"IF(Arbeitsplan!C56<>\"\",IF(Arbeitsplan!H56<>\"\",Arbeitsplan!H56-Arbeitsplan!G56+1,\"\"),\"\")","v":""}]
[{"$f":"IF(C51<>\"\",Arbeitsplan!F57,\"\")","v":""},{"$f":"IF(Arbeitsplan!F57<>\"\",Arbeitsplan!G57,\"\")","v":"2013-09-01"},null,{"$f":"IF(Arbeitsplan!B57<>\"\",IF(Arbeitsplan!H57<>\"\",Arbeitsplan!H57-Arbeitsplan!G57+1,\"\"),\"\")","v":76},{"$f":"IF(Arbeitsplan!C57<>\"\",IF(Arbeitsplan!H57<>\"\",Arbeitsplan!H57-Arbeitsplan!G57+1,\"\"),\"\")","v":""}]
[{"$f":"IF(C52<>\"\",Arbeitsplan!F58,\"\")","v":""},{"$f":"IF(Arbeitsplan!F58<>\"\",Arbeitsplan!G58,\"\")","v":"2013-09-01"},null,null,{"$f":"IF(Arbeitsplan!C58<>\"\",IF(Arbeitsplan!H58<>\"\",Arbeitsplan!H58-Arbeitsplan!G58+1,\"\"),\"\")","v":76}]
[{"$f":"IF(C53<>\"\",Arbeitsplan!F59,\"\")","v":""},{"$f":"IF(Arbeitsplan!F59<>\"\",Arbeitsplan!G59,\"\")","v":"2013-09-01"},null,null,{"$f":"IF(Arbeitsplan!C59<>\"\",IF(Arbeitsplan!H59<>\"\",Arbeitsplan!H59-Arbeitsplan!G59+1,\"\"),\"\")","v":76}]
[{"$f":"IF(C54<>\"\",Arbeitsplan!F60,\"\")","v":""},{"$f":"IF(Arbeitsplan!F60<>\"\",Arbeitsplan!G60,\"\")","v":"2013-09-01"},null,null,{"$f":"IF(Arbeitsplan!C60<>\"\",IF(Arbeitsplan!H60<>\"\",Arbeitsplan!H60-Arbeitsplan!G60+1,\"\"),\"\")","v":76}]
[{"$f":"IF(C55<>\"\",Arbeitsplan!F61,\"\")","v":""},{"$f":"IF(Arbeitsplan!F61<>\"\",Arbeitsplan!G61,\"\")","v":""},{"$f":"IF(Arbeitsplan!A61<>\"\",IF(Arbeitsplan!H61<>\"\",Arbeitsplan!H61-Arbeitsplan!G61+1,\"\"),\"\")","v":""},{"$f":"IF(Arbeitsplan!B61<>\"\",IF(Arbeitsplan!H61<>\"\",Arbeitsplan!H61-Arbeitsplan!G61+1,\"\"),\"\")","v":""},{"$f":"IF(Arbeitsplan!C61<>\"\",IF(Arbeitsplan!H61<>\"\",Arbeitsplan!H61-Arbeitsplan!G61+1,\"\"),\"\")","v":""}]
[{"$f":"IF(C56<>\"\",Arbeitsplan!F62,\"\")","v":""},{"$f":"IF(Arbeitsplan!F62<>\"\",Arbeitsplan!G62,\"\")","v":"2013-11-15"},null,{"$f":"IF(Arbeitsplan!B62<>\"\",IF(Arbeitsplan!H62<>\"\",Arbeitsplan!H62-Arbeitsplan!G62+1,\"\"),\"\")","v":76},{"$f":"IF(Arbeitsplan!C62<>\"\",IF(Arbeitsplan!H62<>\"\",Arbeitsplan!H62-Arbeitsplan!G62+1,\"\"),\"\")","v":""}]
[{"$f":"IF(C57<>\"\",Arbeitsplan!F63,\"\")","v":""},{"$f":"IF(Arbeitsplan!F63<>\"\",Arbeitsplan!G63,\"\")","v":"2013-11-15"},null,null,{"$f":"IF(Arbeitsplan!C63<>\"\",IF(Arbeitsplan!H63<>\"\",Arbeitsplan!H63-Arbeitsplan!G63+1,\"\"),\"\")","v":76}]
[{"$f":"IF(C58<>\"\",Arbeitsplan!F64,\"\")","v":""},{"$f":"IF(Arbeitsplan!F64<>\"\",Arbeitsplan!G64,\"\")","v":"2013-11-15"},null,null,{"$f":"IF(Arbeitsplan!C64<>\"\",IF(Arbeitsplan!H64<>\"\",Arbeitsplan!H64-Arbeitsplan!G64+1,\"\"),\"\")","v":76}]
[{"$f":"IF(C59<>\"\",Arbeitsplan!F65,\"\")","v":""},{"$f":"IF(Arbeitsplan!F65<>\"\",Arbeitsplan!G65,\"\")","v":"2013-11-15"},null,null,{"$f":"IF(Arbeitsplan!C65<>\"\",IF(Arbeitsplan!H65<>\"\",Arbeitsplan!H65-Arbeitsplan!G65+1,\"\"),\"\")","v":76}]
[{"$f":"IF(C60<>\"\",Arbeitsplan!F66,\"\")","v":""},{"$f":"IF(Arbeitsplan!F66<>\"\",Arbeitsplan!G66,\"\")","v":""},{"$f":"IF(Arbeitsplan!A66<>\"\",IF(Arbeitsplan!H66<>\"\",Arbeitsplan!H66-Arbeitsplan!G66+1,\"\"),\"\")","v":""},{"$f":"IF(Arbeitsplan!B66<>\"\",IF(Arbeitsplan!H66<>\"\",Arbeitsplan!H66-Arbeitsplan!G66+1,\"\"),\"\")","v":""},{"$f":"IF(Arbeitsplan!C66<>\"\",IF(Arbeitsplan!H66<>\"\",Arbeitsplan!H66-Arbeitsplan!G66+1,\"\"),\"\")","v":""}]
[{"$f":"IF(C61<>\"\",Arbeitsplan!F67,\"\")","v":""},{"$f":"IF(Arbeitsplan!F67<>\"\",Arbeitsplan!G67,\"\")","v":"2014-01-29"},null,{"$f":"IF(Arbeitsplan!B67<>\"\",IF(Arbeitsplan!H67<>\"\",Arbeitsplan!H67-Arbeitsplan!G67+1,\"\"),\"\")","v":76},{"$f":"IF(Arbeitsplan!C67<>\"\",IF(Arbeitsplan!H67<>\"\",Arbeitsplan!H67-Arbeitsplan!G67+1,\"\"),\"\")","v":""}]
[{"$f":"IF(C62<>\"\",Arbeitsplan!F68,\"\")","v":""},{"$f":"IF(Arbeitsplan!F68<>\"\",Arbeitsplan!G68,\"\")","v":"2014-01-29"},null,null,{"$f":"IF(Arbeitsplan!C68<>\"\",IF(Arbeitsplan!H68<>\"\",Arbeitsplan!H68-Arbeitsplan!G68+1,\"\"),\"\")","v":76}]
[{"$f":"IF(C63<>\"\",Arbeitsplan!F69,\"\")","v":""},{"$f":"IF(Arbeitsplan!F69<>\"\",Arbeitsplan!G69,\"\")","v":"2014-01-29"},null,null,{"$f":"IF(Arbeitsplan!C69<>\"\",IF(Arbeitsplan!H69<>\"\",Arbeitsplan!H69-Arbeitsplan!G69+1,\"\"),\"\")","v":76}]
[{"$f":"IF(C64<>\"\",Arbeitsplan!F70,\"\")","v":""},{"$f":"IF(Arbeitsplan!F70<>\"\",Arbeitsplan!G70,\"\")","v":"2014-01-29"},null,null,{"$f":"IF(Arbeitsplan!C70<>\"\",IF(Arbeitsplan!H70<>\"\",Arbeitsplan!H70-Arbeitsplan!G70+1,\"\"),\"\")","v":76}]
[{"$f":"IF(C65<>\"\",Arbeitsplan!F71,\"\")","v":""},{"$f":"IF(Arbeitsplan!F71<>\"\",Arbeitsplan!G71,\"\")","v":""},{"$f":"IF(Arbeitsplan!A71<>\"\",IF(Arbeitsplan!H71<>\"\",Arbeitsplan!H71-Arbeitsplan!G71+1,\"\"),\"\")","v":""},{"$f":"IF(Arbeitsplan!B71<>\"\",IF(Arbeitsplan!H71<>\"\",Arbeitsplan!H71-Arbeitsplan!G71+1,\"\"),\"\")","v":""},{"$f":"IF(Arbeitsplan!C71<>\"\",IF(Arbeitsplan!H71<>\"\",Arbeitsplan!H71-Arbeitsplan!G71+1,\"\"),\"\")","v":""}]
[{"$f":"IF(C66<>\"\",Arbeitsplan!F72,\"\")","v":""},{"$f":"IF(Arbeitsplan!F72<>\"\",Arbeitsplan!G72,\"\")","v":"2014-04-14"},null,{"$f":"IF(Arbeitsplan!B72<>\"\",IF(Arbeitsplan!H72<>\"\",Arbeitsplan!H72-Arbeitsplan!G72+1,\"\"),\"\")","v":76},{"$f":"IF(Arbeitsplan!C72<>\"\",IF(Arbeitsplan!H72<>\"\",Arbeitsplan!H72-Arbeitsplan!G72+1,\"\"),\"\")","v":""}]
[{"$f":"IF(C67<>\"\",Arbeitsplan!F73,\"\")","v":""},{"$f":"IF(Arbeitsplan!F73<>\"\",Arbeitsplan!G73,\"\")","v":"2014-04-14"},null,null,{"$f":"IF(Arbeitsplan!C73<>\"\",IF(Arbeitsplan!H73<>\"\",Arbeitsplan!H73-Arbeitsplan!G73+1,\"\"),\"\")","v":76}]
[{"$f":"IF(C68<>\"\",Arbeitsplan!F74,\"\")","v":""},{"$f":"IF(Arbeitsplan!F74<>\"\",Arbeitsplan!G74,\"\")","v":"2014-04-14"},null,null,{"$f":"IF(Arbeitsplan!C74<>\"\",IF(Arbeitsplan!H74<>\"\",Arbeitsplan!H74-Arbeitsplan!G74+1,\"\"),\"\")","v":76}]
[{"$f":"IF(C69<>\"\",Arbeitsplan!F75,\"\")","v":""},{"$f":"IF(Arbeitsplan!F75<>\"\",Arbeitsplan!G75,\"\")","v":"2014-04-14"},null,null,{"$f":"IF(Arbeitsplan!C75<>\"\",IF(Arbeitsplan!H75<>\"\",Arbeitsplan!H75-Arbeitsplan!G75+1,\"\"),\"\")","v":76}]
[{"$f":"IF(C70<>\"\",Arbeitsplan!F76,\"\")","v":""},{"$f":"IF(Arbeitsplan!F76<>\"\",Arbeitsplan!G76,\"\")","v":""},{"$f":"IF(Arbeitsplan!A76<>\"\",IF(Arbeitsplan!H76<>\"\",Arbeitsplan!H76-Arbeitsplan!G76+1,\"\"),\"\")","v":""},{"$f":"IF(Arbeitsplan!B76<>\"\",IF(Arbeitsplan!H76<>\"\",Arbeitsplan!H76-Arbeitsplan!G76+1,\"\"),\"\")","v":""},{"$f":"IF(Arbeitsplan!C76<>\"\",IF(Arbeitsplan!H76<>\"\",Arbeitsplan!H76-Arbeitsplan!G76+1,\"\"),\"\")","v":""}]
[{"$f":"IF(C71<>\"\",Arbeitsplan!F77,\"\")","v":""},{"$f":"IF(Arbeitsplan!F77<>\"\",Arbeitsplan!G77,\"\")","v":""},{"$f":"IF(Arbeitsplan!A77<>\"\",IF(Arbeitsplan!H77<>\"\",Arbeitsplan!H77-Arbeitsplan!G77+1,\"\"),\"\")","v":""},{"$f":"IF(Arbeitsplan!B77<>\"\",IF(Arbeitsplan!H77<>\"\",Arbeitsplan!H77-Arbeitsplan!G77+1,\"\"),\"\")","v":""},{"$f":"IF(Arbeitsplan!C77<>\"\",IF(Arbeitsplan!H77<>\"\",Arbeitsplan!H77-Arbeitsplan!G77+1,\"\"),\"\")","v":""}]
[{"$f":"IF(C72<>\"\",Arbeitsplan!F78,\"\")","v":{"$error":"#N/A"}},{"$f":"IF(Arbeitsplan!F78<>\"\",Arbeitsplan!G78,\"\")","v":{"$error":"#N/A"}},{"$f":"IF(Arbeitsplan!A78<>\"\",IF(Arbeitsplan!H78<>\"\",Arbeitsplan!H78-Arbeitsplan!G78+1,\"\"),\"\")","v":{"$error":"#N/A"}},{"$f":"IF(Arbeitsplan!B78<>\"\",IF(Arbeitsplan!H78<>\"\",Arbeitsplan!H78-Arbeitsplan!G78+1,\"\"),\"\")","v":""},{"$f":"IF(Arbeitsplan!C78<>\"\",IF(Arbeitsplan!H78<>\"\",Arbeitsplan!H78-Arbeitsplan!G78+1,\"\"),\"\")","v":""}]
[{"$f":"IF(C73<>\"\",Arbeitsplan!F79,\"\")","v":""},{"$f":"IF(Arbeitsplan!F79<>\"\",Arbeitsplan!G79,\"\")","v":"2013-10-01"},null,{"$f":"IF(Arbeitsplan!B79<>\"\",IF(Arbeitsplan!H79<>\"\",Arbeitsplan!H79-Arbeitsplan!G79+1,\"\"),\"\")","v":{"$error":"#N/A"}},{"$f":"IF(Arbeitsplan!C79<>\"\",IF(Arbeitsplan!H79<>\"\",Arbeitsplan!H79-Arbeitsplan!G79+1,\"\"),\"\")","v":""}]
[{"$f":"IF(C74<>\"\",Arbeitsplan!F80,\"\")","v":""},{"$f":"IF(Arbeitsplan!F80<>\"\",Arbeitsplan!G80,\"\")","v":"2013-10-01"},null,null,{"$f":"IF(Arbeitsplan!C80<>\"\",IF(Arbeitsplan!H80<>\"\",Arbeitsplan!H80-Arbeitsplan!G80+1,\"\"),\"\")","v":{"$error":"#N/A"}}]
[{"$f":"IF(C75<>\"\",Arbeitsplan!F81,\"\")","v":""},{"$f":"IF(Arbeitsplan!F81<>\"\",Arbeitsplan!G81,\"\")","v":"2013-10-01"},null,null,{"$f":"IF(Arbeitsplan!C81<>\"\",IF(Arbeitsplan!H81<>\"\",Arbeitsplan!H81-Arbeitsplan!G81+1,\"\"),\"\")","v":{"$error":"#N/A"}}]
[{"$f":"IF(C76<>\"\",Arbeitsplan!F82,\"\")","v":""},{"$f":"IF(Arbeitsplan!F82<>\"\",Arbeitsplan!G82,\"\")","v":"2013-10-01"},null,null,{"$f":"IF(Arbeitsplan!C82<>\"\",IF(Arbeitsplan!H82<>\"\",Arbeitsplan!H82-Arbeitsplan!G82+1,\"\"),\"\")","v":{"$error":"#N/A"}}]
[{"$f":"IF(C77<>\"\",Arbeitsplan!F83,\"\")","v":""},{"$f":"IF(Arbeitsplan!F83<>\"\",Arbeitsplan!G83,\"\")","v":""},{"$f":"IF(Arbeitsplan!A83<>\"\",IF(Arbeitsplan!H83<>\"\",Arbeitsplan!H83-Arbeitsplan!G83+1,\"\"),\"\")","v":""},{"$f":"IF(Arbeitsplan!B83<>\"\",IF(Arbeitsplan!H83<>\"\",Arbeitsplan!H83-Arbeitsplan!G83+1,\"\"),\"\")","v":""},{"$f":"IF(Arbeitsplan!C83<>\"\",IF(Arbeitsplan!H83<>\"\",Arbeitsplan!H83-Arbeitsplan!G83+1,\"\"),\"\")","v":""}]
[{"$f":"IF(C78<>\"\",Arbeitsplan!F84,\"\")","v":""},{"$f":"IF(Arbeitsplan!F84<>\"\",Arbeitsplan!G84,\"\")","v":{"$error":"#N/A"}},null,{"$f":"IF(Arbeitsplan!B84<>\"\",IF(Arbeitsplan!H84<>\"\",Arbeitsplan!H84-Arbeitsplan!G84+1,\"\"),\"\")","v":{"$error":"#N/A"}},{"$f":"IF(Arbeitsplan!C84<>\"\",IF(Arbeitsplan!H84<>\"\",Arbeitsplan!H84-Arbeitsplan!G84+1,\"\"),\"\")","v":""}]
[{"$f":"IF(C79<>\"\",Arbeitsplan!F85,\"\")","v":""},{"$f":"IF(Arbeitsplan!F85<>\"\",Arbeitsplan!G85,\"\")","v":{"$error":"#N/A"}},null,null,{"$f":"IF(Arbeitsplan!C85<>\"\",IF(Arbeitsplan!H85<>\"\",Arbeitsplan!H85-Arbeitsplan!G85+1,\"\"),\"\")","v":{"$error":"#N/A"}}]
[{"$f":"IF(C80<>\"\",Arbeitsplan!F86,\"\")","v":""},{"$f":"IF(Arbeitsplan!F86<>\"\",Arbeitsplan!G86,\"\")","v":{"$error":"#N/A"}},null,null,{"$f":"IF(Arbeitsplan!C86<>\"\",IF(Arbeitsplan!H86<>\"\",Arbeitsplan!H86-Arbeitsplan!G86+1,\"\"),\"\")","v":{"$error":"#N/A"}}]
[{"$f":"IF(C81<>\"\",Arbeitsplan!F87,\"\")","v":""},{"$f":"IF(Arbeitsplan!F87<>\"\",Arbeitsplan!G87,\"\")","v":{"$error":"#N/A"}},null,null,{"$f":"IF(Arbeitsplan!C87<>\"\",IF(Arbeitsplan!H87<>\"\",Arbeitsplan!H87-Arbeitsplan!G87+1,\"\"),\"\")","v":{"$error":"#N/A"}}]
[{"$f":"IF(C82<>\"\",Arbeitsplan!F88,\"\")","v":""},{"$f":"IF(Arbeitsplan!F88<>\"\",Arbeitsplan!G88,\"\")","v":""},{"$f":"IF(Arbeitsplan!A88<>\"\",IF(Arbeitsplan!H88<>\"\",Arbeitsplan!H88-Arbeitsplan!G88+1,\"\"),\"\")","v":""},{"$f":"IF(Arbeitsplan!B88<>\"\",IF(Arbeitsplan!H88<>\"\",Arbeitsplan!H88-Arbeitsplan!G88+1,\"\"),\"\")","v":""},{"$f":"IF(Arbeitsplan!C88<>\"\",IF(Arbeitsplan!H88<>\"\",Arbeitsplan!H88-Arbeitsplan!G88+1,\"\"),\"\")","v":""}]
[{"$f":"IF(C83<>\"\",Arbeitsplan!F89,\"\")","v":""},{"$f":"IF(Arbeitsplan!F89<>\"\",Arbeitsplan!G89,\"\")","v":{"$error":"#N/A"}},null,{"$f":"IF(Arbeitsplan!B89<>\"\",IF(Arbeitsplan!H89<>\"\",Arbeitsplan!H89-Arbeitsplan!G89+1,\"\"),\"\")","v":{"$error":"#N/A"}},{"$f":"IF(Arbeitsplan!C89<>\"\",IF(Arbeitsplan!H89<>\"\",Arbeitsplan!H89-Arbeitsplan!G89+1,\"\"),\"\")","v":""}]
[{"$f":"IF(C84<>\"\",Arbeitsplan!F90,\"\")","v":""},{"$f":"IF(Arbeitsplan!F90<>\"\",Arbeitsplan!G90,\"\")","v":{"$error":"#N/A"}},null,null,{"$f":"IF(Arbeitsplan!C90<>\"\",IF(Arbeitsplan!H90<>\"\",Arbeitsplan!H90-Arbeitsplan!G90+1,\"\"),\"\")","v":{"$error":"#N/A"}}]
[{"$f":"IF(C85<>\"\",Arbeitsplan!F91,\"\")","v":""},{"$f":"IF(Arbeitsplan!F91<>\"\",Arbeitsplan!G91,\"\")","v":{"$error":"#N/A"}},null,null,{"$f":"IF(Arbeitsplan!C91<>\"\",IF(Arbeitsplan!H91<>\"\",Arbeitsplan!H91-Arbeitsplan!G91+1,\"\"),\"\")","v":{"$error":"#N/A"}}]
[{"$f":"IF(C86<>\"\",Arbeitsplan!F92,\"\")","v":""},{"$f":"IF(Arbeitsplan!F92<>\"\",Arbeitsplan!G92,\"\")","v":{"$error":"#N/A"}},null,null,{"$f":"IF(Arbeitsplan!C92<>\"\",IF(Arbeitsplan!H92<>\"\",Arbeitsplan!H92-Arbeitsplan!G92+1,\"\"),\"\")","v":{"$error":"#N/A"}}]
[{"$f":"IF(C87<>\"\",Arbeitsplan!F93,\"\")","v":""},{"$f":"IF(Arbeitsplan!F93<>\"\",Arbeitsplan!G93,\"\")","v":""},{"$f":"IF(Arbeitsplan!A93<>\"\",IF(Arbeitsplan!H93<>\"\",Arbeitsplan!H93-Arbeitsplan!G93+1,\"\"),\"\")","v":""},{"$f":"IF(Arbeitsplan!B93<>\"\",IF(Arbeitsplan!H93<>\"\",Arbeitsplan!H93-Arbeitsplan!G93+1,\"\"),\"\")","v":""},{"$f":"IF(Arbeitsplan!C93<>\"\",IF(Arbeitsplan!H93<>\"\",Arbeitsplan!H93-Arbeitsplan!G93+1,\"\"),\"\")","v":""}]
[{"$f":"IF(C88<>\"\",Arbeitsplan!F94,\"\")","v":""},{"$f":"IF(Arbeitsplan!F94<>\"\",Arbeitsplan!G94,\"\")","v":{"$error":"#N/A"}},null,{"$f":"IF(Arbeitsplan!B94<>\"\",IF(Arbeitsplan!H94<>\"\",Arbeitsplan!H94-Arbeitsplan!G94+1,\"\"),\"\")","v":{"$error":"#N/A"}},{"$f":"IF(Arbeitsplan!C94<>\"\",IF(Arbeitsplan!H94<>\"\",Arbeitsplan!H94-Arbeitsplan!G94+1,\"\"),\"\")","v":""}]
[{"$f":"IF(C89<>\"\",Arbeitsplan!F95,\"\")","v":""},{"$f":"IF(Arbeitsplan!F95<>\"\",Arbeitsplan!G95,\"\")","v":{"$error":"#N/A"}},null,null,{"$f":"IF(Arbeitsplan!C95<>\"\",IF(Arbeitsplan!H95<>\"\",Arbeitsplan!H95-Arbeitsplan!G95+1,\"\"),\"\")","v":{"$error":"#N/A"}}]
[{"$f":"IF(C90<>\"\",Arbeitsplan!F96,\"\")","v":""},{"$f":"IF(Arbeitsplan!F96<>\"\",Arbeitsplan!G96,\"\")","v":{"$error":"#N/A"}},null,null,{"$f":"IF(Arbeitsplan!C96<>\"\",IF(Arbeitsplan!H96<>\"\",Arbeitsplan!H96-Arbeitsplan!G96+1,\"\"),\"\")","v":{"$error":"#N/A"}}]
[{"$f":"IF(C91<>\"\",Arbeitsplan!F97,\"\")","v":""},{"$f":"IF(Arbeitsplan!F97<>\"\",Arbeitsplan!G97,\"\")","v":{"$error":"#N/A"}},null,null,{"$f":"IF(Arbeitsplan!C97<>\"\",IF(Arbeitsplan!H97<>\"\",Arbeitsplan!H97-Arbeitsplan!G97+1,\"\"),\"\")","v":{"$error":"#N/A"}}]
[{"$f":"IF(C92<>\"\",Arbeitsplan!F98,\"\")","v":""},{"$f":"IF(Arbeitsplan!F98<>\"\",Arbeitsplan!G98,\"\")","v":""},{"$f":"IF(Arbeitsplan!A98<>\"\",IF(Arbeitsplan!H98<>\"\",Arbeitsplan!H98-Arbeitsplan!G98+1,\"\"),\"\")","v":""},{"$f":"IF(Arbeitsplan!B98<>\"\",IF(Arbeitsplan!H98<>\"\",Arbeitsplan!H98-Arbeitsplan!G98+1,\"\"),\"\")","v":""},{"$f":"IF(Arbeitsplan!C98<>\"\",IF(Arbeitsplan!H98<>\"\",Arbeitsplan!H98-Arbeitsplan!G98+1,\"\"),\"\")","v":""}]
[{"$f":"IF(C93<>\"\",Arbeitsplan!F99,\"\")","v":""},{"$f":"IF(Arbeitsplan!F99<>\"\",Arbeitsplan!G99,\"\")","v":""},{"$f":"IF(Arbeitsplan!A99<>\"\",IF(Arbeitsplan!H99<>\"\",Arbeitsplan!H99-Arbeitsplan!G99+1,\"\"),\"\")","v":""},{"$f":"IF(Arbeitsplan!B99<>\"\",IF(Arbeitsplan!H99<>\"\",Arbeitsplan!H99-Arbeitsplan!G99+1,\"\"),\"\")","v":""},{"$f":"IF(Arbeitsplan!C99<>\"\",IF(Arbeitsplan!H99<>\"\",Arbeitsplan!H99-Arbeitsplan!G99+1,\"\"),\"\")","v":""}]
[{"$f":"IF(C94<>\"\",Arbeitsplan!F100,\"\")","v":{"$error":"#N/A"}},{"$f":"IF(Arbeitsplan!F100<>\"\",Arbeitsplan!G100,\"\")","v":{"$error":"#N/A"}},{"$f":"IF(Arbeitsplan!A100<>\"\",IF(Arbeitsplan!H100<>\"\",Arbeitsplan!H100-Arbeitsplan!G100+1,\"\"),\"\")","v":{"$error":"#N/A"}},{"$f":"IF(Arbeitsplan!B100<>\"\",IF(Arbeitsplan!H100<>\"\",Arbeitsplan!H100-Arbeitsplan!G100+1,\"\"),\"\")","v":""},{"$f":"IF(Arbeitsplan!C100<>\"\",IF(Arbeitsplan!H100<>\"\",Arbeitsplan!H100-Arbeitsplan!G100+1,\"\"),\"\")","v":""}]
[{"$f":"IF(C95<>\"\",Arbeitsplan!F101,\"\")","v":""},{"$f":"IF(Arbeitsplan!F101<>\"\",Arbeitsplan!G101,\"\")","v":"00:00:00"},null,{"$f":"IF(Arbeitsplan!B101<>\"\",IF(Arbeitsplan!H101<>\"\",Arbeitsplan!H101-Arbeitsplan!G101+1,\"\"),\"\")","v":{"$error":"#N/A"}},{"$f":"IF(Arbeitsplan!C101<>\"\",IF(Arbeitsplan!H101<>\"\",Arbeitsplan!H101-Arbeitsplan!G101+1,\"\"),\"\")","v":""}]
[{"$f":"IF(C96<>\"\",Arbeitsplan!F102,\"\")","v":""},{"$f":"IF(Arbeitsplan!F102<>\"\",Arbeitsplan!G102,\"\")","v":"00:00:00"},null,null,{"$f":"IF(Arbeitsplan!C102<>\"\",IF(Arbeitsplan!H102<>\"\",Arbeitsplan!H102-Arbeitsplan!G102+1,\"\"),\"\")","v":{"$error":"#N/A"}}]
[{"$f":"IF(C97<>\"\",Arbeitsplan!F103,\"\")","v":""},{"$f":"IF(Arbeitsplan!F103<>\"\",Arbeitsplan!G103,\"\")","v":"00:00:00"},null,null,{"$f":"IF(Arbeitsplan!C103<>\"\",IF(Arbeitsplan!H103<>\"\",Arbeitsplan!H103-Arbeitsplan!G103+1,\"\"),\"\")","v":{"$error":"#N/A"}}]
[{"$f":"IF(C98<>\"\",Arbeitsplan!F104,\"\")","v":""},{"$f":"IF(Arbeitsplan!F104<>\"\",Arbeitsplan!G104,\"\")","v":"00:00:00"},null,null,{"$f":"IF(Arbeitsplan!C104<>\"\",IF(Arbeitsplan!H104<>\"\",Arbeitsplan!H104-Arbeitsplan!G104+1,\"\"),\"\")","v":{"$error":"#N/A"}}]
[{"$f":"IF(C99<>\"\",Arbeitsplan!F105,\"\")","v":""},{"$f":"IF(Arbeitsplan!F105<>\"\",Arbeitsplan!G105,\"\")","v":""},{"$f":"IF(Arbeitsplan!A105<>\"\",IF(Arbeitsplan!H105<>\"\",Arbeitsplan!H105-Arbeitsplan!G105+1,\"\"),\"\")","v":""},{"$f":"IF(Arbeitsplan!B105<>\"\",IF(Arbeitsplan!H105<>\"\",Arbeitsplan!H105-Arbeitsplan!G105+1,\"\"),\"\")","v":""},{"$f":"IF(Arbeitsplan!C105<>\"\",IF(Arbeitsplan!H105<>\"\",Arbeitsplan!H105-Arbeitsplan!G105+1,\"\"),\"\")","v":""}]
[{"$f":"IF(C100<>\"\",Arbeitsplan!F106,\"\")","v":""},{"$f":"IF(Arbeitsplan!F106<>\"\",Arbeitsplan!G106,\"\")","v":{"$error":"#N/A"}},null,{"$f":"IF(Arbeitsplan!B106<>\"\",IF(Arbeitsplan!H106<>\"\",Arbeitsplan!H106-Arbeitsplan!G106+1,\"\"),\"\")","v":{"$error":"#N/A"}},{"$f":"IF(Arbeitsplan!C106<>\"\",IF(Arbeitsplan!H106<>\"\",Arbeitsplan!H106-Arbeitsplan!G106+1,\"\"),\"\")","v":""}]
[{"$f":"IF(C101<>\"\",Arbeitsplan!F107,\"\")","v":""},{"$f":"IF(Arbeitsplan!F107<>\"\",Arbeitsplan!G107,\"\")","v":{"$error":"#N/A"}},null,null,{"$f":"IF(Arbeitsplan!C107<>\"\",IF(Arbeitsplan!H107<>\"\",Arbeitsplan!H107-Arbeitsplan!G107+1,\"\"),\"\")","v":{"$error":"#N/A"}}]
[{"$f":"IF(C102<>\"\",Arbeitsplan!F108,\"\")","v":""},{"$f":"IF(Arbeitsplan!F108<>\"\",Arbeitsplan!G108,\"\")","v":{"$error":"#N/A"}},null,null,{"$f":"IF(Arbeitsplan!C108<>\"\",IF(Arbeitsplan!H108<>\"\",Arbeitsplan!H108-Arbeitsplan!G108+1,\"\"),\"\")","v":{"$error":"#N/A"}}]
[{"$f":"IF(C103<>\"\",Arbeitsplan!F109,\"\")","v":""},{"$f":"IF(Arbeitsplan!F109<>\"\",Arbeitsplan!G109,\"\")","v":{"$error":"#N/A"}},null,null,{"$f":"IF(Arbeitsplan!C109<>\"\",IF(Arbeitsplan!H109<>\"\",Arbeitsplan!H109-Arbeitsplan!G109+1,\"\"),\"\")","v":{"$error":"#N/A"}}]
[{"$f":"IF(C104<>\"\",Arbeitsplan!F110,\"\")","v":""},{"$f":"IF(Arbeitsplan!F110<>\"\",Arbeitsplan!G110,\"\")","v":""},{"$f":"IF(Arbeitsplan!A110<>\"\",IF(Arbeitsplan!H110<>\"\",Arbeitsplan!H110-Arbeitsplan!G110+1,\"\"),\"\")","v":""},{"$f":"IF(Arbeitsplan!B110<>\"\",IF(Arbeitsplan!H110<>\"\",Arbeitsplan!H110-Arbeitsplan!G110+1,\"\"),\"\")","v":""},{"$f":"IF(Arbeitsplan!C110<>\"\",IF(Arbeitsplan!H110<>\"\",Arbeitsplan!H110-Arbeitsplan!G110+1,\"\"),\"\")","v":""}]
[{"$f":"IF(C105<>\"\",Arbeitsplan!F111,\"\")","v":""},{"$f":"IF(Arbeitsplan!F111<>\"\",Arbeitsplan!G111,\"\")","v":{"$error":"#N/A"}},null,{"$f":"IF(Arbeitsplan!B111<>\"\",IF(Arbeitsplan!H111<>\"\",Arbeitsplan!H111-Arbeitsplan!G111+1,\"\"),\"\")","v":{"$error":"#N/A"}},{"$f":"IF(Arbeitsplan!C111<>\"\",IF(Arbeitsplan!H111<>\"\",Arbeitsplan!H111-Arbeitsplan!G111+1,\"\"),\"\")","v":""}]
[{"$f":"IF(C106<>\"\",Arbeitsplan!F112,\"\")","v":""},{"$f":"IF(Arbeitsplan!F112<>\"\",Arbeitsplan!G112,\"\")","v":{"$error":"#N/A"}},null,null,{"$f":"IF(Arbeitsplan!C112<>\"\",IF(Arbeitsplan!H112<>\"\",Arbeitsplan!H112-Arbeitsplan!G112+1,\"\"),\"\")","v":{"$error":"#N/A"}}]
[{"$f":"IF(C107<>\"\",Arbeitsplan!F113,\"\")","v":""},{"$f":"IF(Arbeitsplan!F113<>\"\",Arbeitsplan!G113,\"\")","v":{"$error":"#N/A"}},null,null,{"$f":"IF(Arbeitsplan!C113<>\"\",IF(Arbeitsplan!H113<>\"\",Arbeitsplan!H113-Arbeitsplan!G113+1,\"\"),\"\")","v":{"$error":"#N/A"}}]
[{"$f":"IF(C108<>\"\",Arbeitsplan!F114,\"\")","v":""},{"$f":"IF(Arbeitsplan!F114<>\"\",Arbeitsplan!G114,\"\")","v":{"$error":"#N/A"}},null,null,{"$f":"IF(Arbeitsplan!C114<>\"\",IF(Arbeitsplan!H114<>\"\",Arbeitsplan!H114-Arbeitsplan!G114+1,\"\"),\"\")","v":{"$error":"#N/A"}}]
[{"$f":"IF(C109<>\"\",Arbeitsplan!F115,\"\")","v":""},{"$f":"IF(Arbeitsplan!F115<>\"\",Arbeitsplan!G115,\"\")","v":""},{"$f":"IF(Arbeitsplan!A115<>\"\",IF(Arbeitsplan!H115<>\"\",Arbeitsplan!H115-Arbeitsplan!G115+1,\"\"),\"\")","v":""},{"$f":"IF(Arbeitsplan!B115<>\"\",IF(Arbeitsplan!H115<>\"\",Arbeitsplan!H115-Arbeitsplan!G115+1,\"\"),\"\")","v":""},{"$f":"IF(Arbeitsplan!C115<>\"\",IF(Arbeitsplan!H115<>\"\",Arbeitsplan!H115-Arbeitsplan!G115+1,\"\"),\"\")","v":""}]
[{"$f":"IF(C110<>\"\",Arbeitsplan!F116,\"\")","v":""},{"$f":"IF(Arbeitsplan!F116<>\"\",Arbeitsplan!G116,\"\")","v":{"$error":"#N/A"}},null,{"$f":"IF(Arbeitsplan!B116<>\"\",IF(Arbeitsplan!H116<>\"\",Arbeitsplan!H116-Arbeitsplan!G116+1,\"\"),\"\")","v":{"$error":"#N/A"}},{"$f":"IF(Arbeitsplan!C116<>\"\",IF(Arbeitsplan!H116<>\"\",Arbeitsplan!H116-Arbeitsplan!G116+1,\"\"),\"\")","v":""}]
[{"$f":"IF(C111<>\"\",Arbeitsplan!F117,\"\")","v":""},{"$f":"IF(Arbeitsplan!F117<>\"\",Arbeitsplan!G117,\"\")","v":{"$error":"#N/A"}},null,null,{"$f":"IF(Arbeitsplan!C117<>\"\",IF(Arbeitsplan!H117<>\"\",Arbeitsplan!H117-Arbeitsplan!G117+1,\"\"),\"\")","v":{"$error":"#N/A"}}]
[{"$f":"IF(C112<>\"\",Arbeitsplan!F118,\"\")","v":""},{"$f":"IF(Arbeitsplan!F118<>\"\",Arbeitsplan!G118,\"\")","v":{"$error":"#N/A"}},null,null,{"$f":"IF(Arbeitsplan!C118<>\"\",IF(Arbeitsplan!H118<>\"\",Arbeitsplan!H118-Arbeitsplan!G118+1,\"\"),\"\")","v":{"$error":"#N/A"}}]
[{"$f":"IF(C113<>\"\",Arbeitsplan!F119,\"\")","v":""},{"$f":"IF(Arbeitsplan!F119<>\"\",Arbeitsplan!G119,\"\")","v":{"$error":"#N/A"}},null,null,{"$f":"IF(Arbeitsplan!C119<>\"\",IF(Arbeitsplan!H119<>\"\",Arbeitsplan!H119-Arbeitsplan!G119+1,\"\"),\"\")","v":{"$error":"#N/A"}}]
[{"$f":"IF(C114<>\"\",Arbeitsplan!F120,\"\")","v":""},{"$f":"IF(Arbeitsplan!F120<>\"\",Arbeitsplan!G120,\"\")","v":""}]
[{"$f":"IF(C115<>\"\",Arbeitsplan!F121,\"\")","v":""},{"$f":"IF(Arbeitsplan!F121<>\"\",Arbeitsplan!G121,\"\")","v":""}]
[{"$f":"IF(C116<>\"\",Arbeitsplan!F122,\"\")","v":{"$error":"#N/A"}},{"$f":"IF(Arbeitsplan!F122<>\"\",Arbeitsplan!G122,\"\")","v":{"$error":"#N/A"}},{"$f":"IF(Arbeitsplan!A122<>\"\",IF(Arbeitsplan!H122<>\"\",Arbeitsplan!H122-Arbeitsplan!G122+1,\"\"),\"\")","v":{"$error":"#N/A"}},{"$f":"IF(Arbeitsplan!B122<>\"\",IF(Arbeitsplan!H122<>\"\",Arbeitsplan!H122-Arbeitsplan!G122+1,\"\"),\"\")","v":""},{"$f":"IF(Arbeitsplan!C122<>\"\",IF(Arbeitsplan!H122<>\"\",Arbeitsplan!H122-Arbeitsplan!G122+1,\"\"),\"\")","v":""}]
[{"$f":"IF(C117<>\"\",Arbeitsplan!F123,\"\")","v":""},{"$f":"IF(Arbeitsplan!F123<>\"\",Arbeitsplan!G123,\"\")","v":"00:00:00"},null,{"$f":"IF(Arbeitsplan!B123<>\"\",IF(Arbeitsplan!H123<>\"\",Arbeitsplan!H123-Arbeitsplan!G123+1,\"\"),\"\")","v":{"$error":"#N/A"}},{"$f":"IF(Arbeitsplan!C123<>\"\",IF(Arbeitsplan!H123<>\"\",Arbeitsplan!H123-Arbeitsplan!G123+1,\"\"),\"\")","v":""}]
[{"$f":"IF(C118<>\"\",Arbeitsplan!F124,\"\")","v":""},{"$f":"IF(Arbeitsplan!F124<>\"\",Arbeitsplan!G124,\"\")","v":"00:00:00"},null,null,{"$f":"IF(Arbeitsplan!C124<>\"\",IF(Arbeitsplan!H124<>\"\",Arbeitsplan!H124-Arbeitsplan!G124+1,\"\"),\"\")","v":{"$error":"#N/A"}}]
[{"$f":"IF(C119<>\"\",Arbeitsplan!F125,\"\")","v":""},{"$f":"IF(Arbeitsplan!F125<>\"\",Arbeitsplan!G125,\"\")","v":"00:00:00"},null,null,{"$f":"IF(Arbeitsplan!C125<>\"\",IF(Arbeitsplan!H125<>\"\",Arbeitsplan!H125-Arbeitsplan!G125+1,\"\"),\"\")","v":{"$error":"#N/A"}}]
[{"$f":"IF(C120<>\"\",Arbeitsplan!F126,\"\")","v":""},{"$f":"IF(Arbeitsplan!F126<>\"\",Arbeitsplan!G126,\"\")","v":"00:00:00"},null,null,{"$f":"IF(Arbeitsplan!C126<>\"\",IF(Arbeitsplan!H126<>\"\",Arbeitsplan!H126-Arbeitsplan!G126+1,\"\"),\"\")","v":{"$error":"#N/A"}}]
[{"$f":"IF(C121<>\"\",Arbeitsplan!F127,\"\")","v":""},{"$f":"IF(Arbeitsplan!F127<>\"\",Arbeitsplan!G127,\"\")","v":""},{"$f":"IF(Arbeitsplan!A127<>\"\",IF(Arbeitsplan!H127<>\"\",Arbeitsplan!H127-Arbeitsplan!G127+1,\"\"),\"\")","v":""},{"$f":"IF(Arbeitsplan!B127<>\"\",IF(Arbeitsplan!H127<>\"\",Arbeitsplan!H127-Arbeitsplan!G127+1,\"\"),\"\")","v":""},{"$f":"IF(Arbeitsplan!C127<>\"\",IF(Arbeitsplan!H127<>\"\",Arbeitsplan!H127-Arbeitsplan!G127+1,\"\"),\"\")","v":""}]
[{"$f":"IF(C122<>\"\",Arbeitsplan!F128,\"\")","v":""},{"$f":"IF(Arbeitsplan!F128<>\"\",Arbeitsplan!G128,\"\")","v":{"$error":"#N/A"}},null,{"$f":"IF(Arbeitsplan!B128<>\"\",IF(Arbeitsplan!H128<>\"\",Arbeitsplan!H128-Arbeitsplan!G128+1,\"\"),\"\")","v":{"$error":"#N/A"}},{"$f":"IF(Arbeitsplan!C128<>\"\",IF(Arbeitsplan!H128<>\"\",Arbeitsplan!H128-Arbeitsplan!G128+1,\"\"),\"\")","v":""}]
[{"$f":"IF(C123<>\"\",Arbeitsplan!F129,\"\")","v":""},{"$f":"IF(Arbeitsplan!F129<>\"\",Arbeitsplan!G129,\"\")","v":{"$error":"#N/A"}},null,null,{"$f":"IF(Arbeitsplan!C129<>\"\",IF(Arbeitsplan!H129<>\"\",Arbeitsplan!H129-Arbeitsplan!G129+1,\"\"),\"\")","v":{"$error":"#N/A"}}]
[{"$f":"IF(C124<>\"\",Arbeitsplan!F130,\"\")","v":""},{"$f":"IF(Arbeitsplan!F130<>\"\",Arbeitsplan!G130,\"\")","v":{"$error":"#N/A"}},null,null,{"$f":"IF(Arbeitsplan!C130<>\"\",IF(Arbeitsplan!H130<>\"\",Arbeitsplan!H130-Arbeitsplan!G130+1,\"\"),\"\")","v":{"$error":"#N/A"}}]
[{"$f":"IF(C125<>\"\",Arbeitsplan!F131,\"\")","v":""},{"$f":"IF(Arbeitsplan!F131<>\"\",Arbeitsplan!G131,\"\")","v":{"$error":"#N/A"}},null,null,{"$f":"IF(Arbeitsplan!C131<>\"\",IF(Arbeitsplan!H131<>\"\",Arbeitsplan!H131-Arbeitsplan!G131+1,\"\"),\"\")","v":{"$error":"#N/A"}}]
[{"$f":"IF(C126<>\"\",Arbeitsplan!F132,\"\")","v":""},{"$f":"IF(Arbeitsplan!F132<>\"\",Arbeitsplan!G132,\"\")","v":""},{"$f":"IF(Arbeitsplan!A132<>\"\",IF(Arbeitsplan!H132<>\"\",Arbeitsplan!H132-Arbeitsplan!G132+1,\"\"),\"\")","v":""},{"$f":"IF(Arbeitsplan!B132<>\"\",IF(Arbeitsplan!H132<>\"\",Arbeitsplan!H132-Arbeitsplan!G132+1,\"\"),\"\")","v":""},{"$f":"IF(Arbeitsplan!C132<>\"\",IF(Arbeitsplan!H132<>\"\",Arbeitsplan!H132-Arbeitsplan!G132+1,\"\"),\"\")","v":""}]
[{"$f":"IF(C127<>\"\",Arbeitsplan!F133,\"\")","v":""},{"$f":"IF(Arbeitsplan!F133<>\"\",Arbeitsplan!G133,\"\")","v":{"$error":"#N/A"}},null,{"$f":"IF(Arbeitsplan!B133<>\"\",IF(Arbeitsplan!H133<>\"\",Arbeitsplan!H133-Arbeitsplan!G133+1,\"\"),\"\")","v":{"$error":"#N/A"}},{"$f":"IF(Arbeitsplan!C133<>\"\",IF(Arbeitsplan!H133<>\"\",Arbeitsplan!H133-Arbeitsplan!G133+1,\"\"),\"\")","v":""}]
[{"$f":"IF(C128<>\"\",Arbeitsplan!F134,\"\")","v":""},{"$f":"IF(Arbeitsplan!F134<>\"\",Arbeitsplan!G134,\"\")","v":{"$error":"#N/A"}},null,null,{"$f":"IF(Arbeitsplan!C134<>\"\",IF(Arbeitsplan!H134<>\"\",Arbeitsplan!H134-Arbeitsplan!G134+1,\"\"),\"\")","v":{"$error":"#N/A"}}]
[{"$f":"IF(C129<>\"\",Arbeitsplan!F135,\"\")","v":""},{"$f":"IF(Arbeitsplan!F135<>\"\",Arbeitsplan!G135,\"\")","v":{"$error":"#N/A"}},null,null,{"$f":"IF(Arbeitsplan!C135<>\"\",IF(Arbeitsplan!H135<>\"\",Arbeitsplan!H135-Arbeitsplan!G135+1,\"\"),\"\")","v":{"$error":"#N/A"}}]
[{"$f":"IF(C130<>\"\",Arbeitsplan!F136,\"\")","v":""},{"$f":"IF(Arbeitsplan!F136<>\"\",Arbeitsplan!G136,\"\")","v":{"$error":"#N/A"}},null,null,{"$f":"IF(Arbeitsplan!C136<>\"\",IF(Arbeitsplan!H136<>\"\",Arbeitsplan!H136-Arbeitsplan!G136+1,\"\"),\"\")","v":{"$error":"#N/A"}}]
[{"$f":"IF(C131<>\"\",Arbeitsplan!F137,\"\")","v":""},{"$f":"IF(Arbeitsplan!F137<>\"\",Arbeitsplan!G137,\"\")","v":""},{"$f":"IF(Arbeitsplan!A137<>\"\",IF(Arbeitsplan!H137<>\"\",Arbeitsplan!H137-Arbeitsplan!G137+1,\"\"),\"\")","v":""},{"$f":"IF(Arbeitsplan!B137<>\"\",IF(Arbeitsplan!H137<>\"\",Arbeitsplan!H137-Arbeitsplan!G137+1,\"\"),\"\")","v":""},{"$f":"IF(Arbeitsplan!C137<>\"\",IF(Arbeitsplan!H137<>\"\",Arbeitsplan!H137-Arbeitsplan!G137+1,\"\"),\"\")","v":""}]
[{"$f":"IF(C132<>\"\",Arbeitsplan!F138,\"\")","v":""},{"$f":"IF(Arbeitsplan!F138<>\"\",Arbeitsplan!G138,\"\")","v":{"$error":"#N/A"}},null,{"$f":"IF(Arbeitsplan!B138<>\"\",IF(Arbeitsplan!H138<>\"\",Arbeitsplan!H138-Arbeitsplan!G138+1,\"\"),\"\")","v":{"$error":"#N/A"}},{"$f":"IF(Arbeitsplan!C138<>\"\",IF(Arbeitsplan!H138<>\"\",Arbeitsplan!H138-Arbeitsplan!G138+1,\"\"),\"\")","v":""}]
[{"$f":"IF(C133<>\"\",Arbeitsplan!F139,\"\")","v":""},{"$f":"IF(Arbeitsplan!F139<>\"\",Arbeitsplan!G139,\"\")","v":{"$error":"#N/A"}},null,null,{"$f":"IF(Arbeitsplan!C139<>\"\",IF(Arbeitsplan!H139<>\"\",Arbeitsplan!H139-Arbeitsplan!G139+1,\"\"),\"\")","v":{"$error":"#N/A"}}]
[{"$f":"IF(C134<>\"\",Arbeitsplan!F140,\"\")","v":""},{"$f":"IF(Arbeitsplan!F140<>\"\",Arbeitsplan!G140,\"\")","v":{"$error":"#N/A"}},null,null,{"$f":"IF(Arbeitsplan!C140<>\"\",IF(Arbeitsplan!H140<>\"\",Arbeitsplan!H140-Arbeitsplan!G140+1,\"\"),\"\")","v":{"$error":"#N/A"}}]
[{"$f":"IF(C135<>\"\",Arbeitsplan!F141,\"\")","v":""},{"$f":"IF(Arbeitsplan!F141<>\"\",Arbeitsplan!G141,\"\")","v":{"$error":"#N/A"}},null,null,{"$f":"IF(Arbeitsplan!C141<>\"\",IF(Arbeitsplan!H141<>\"\",Arbeitsplan!H141-Arbeitsplan!G141+1,\"\"),\"\")","v":{"$error":"#N/A"}}]
[{"$f":"IF(C136<>\"\",Arbeitsplan!F142,\"\")","v":""},{"$f":"IF(Arbeitsplan!F142<>\"\",Arbeitsplan!G142,\"\")","v":""}]
[{"$f":"IF(C137<>\"\",Arbeitsplan!F143,\"\")","v":""},{"$f":"IF(Arbeitsplan!F143<>\"\",Arbeitsplan!G143,\"\")","v":""}]
[{"$f":"IF(C138<>\"\",Arbeitsplan!F144,\"\")","v":{"$error":"#N/A"}},{"$f":"IF(Arbeitsplan!F144<>\"\",Arbeitsplan!G144,\"\")","v":{"$error":"#N/A"}},{"$f":"IF(Arbeitsplan!A144<>\"\",IF(Arbeitsplan!H144<>\"\",Arbeitsplan!H144-Arbeitsplan!G144+1,\"\"),\"\")","v":{"$error":"#N/A"}},{"$f":"IF(Arbeitsplan!B144<>\"\",IF(Arbeitsplan!H144<>\"\",Arbeitsplan!H144-Arbeitsplan!G144+1,\"\"),\"\")","v":""},{"$f":"IF(Arbeitsplan!C144<>\"\",IF(Arbeitsplan!H144<>\"\",Arbeitsplan!H144-Arbeitsplan!G144+1,\"\"),\"\")","v":""}]
[{"$f":"IF(C139<>\"\",Arbeitsplan!F145,\"\")","v":""},{"$f":"IF(Arbeitsplan!F145<>\"\",Arbeitsplan!G145,\"\")","v":"00:00:00"},null,{"$f":"IF(Arbeitsplan!B145<>\"\",IF(Arbeitsplan!H145<>\"\",Arbeitsplan!H145-Arbeitsplan!G145+1,\"\"),\"\")","v":{"$error":"#N/A"}},{"$f":"IF(Arbeitsplan!C145<>\"\",IF(Arbeitsplan!H145<>\"\",Arbeitsplan!H145-Arbeitsplan!G145+1,\"\"),\"\")","v":""}]
[{"$f":"IF(C140<>\"\",Arbeitsplan!F146,\"\")","v":""},{"$f":"IF(Arbeitsplan!F146<>\"\",Arbeitsplan!G146,\"\")","v":"00:00:00"},null,null,{"$f":"IF(Arbeitsplan!C146<>\"\",IF(Arbeitsplan!H146<>\"\",Arbeitsplan!H146-Arbeitsplan!G146+1,\"\"),\"\")","v":{"$error":"#N/A"}}]
[{"$f":"IF(C141<>\"\",Arbeitsplan!F147,\"\")","v":""},{"$f":"IF(Arbeitsplan!F147<>\"\",Arbeitsplan!G147,\"\")","v":"00:00:00"},null,null,{"$f":"IF(Arbeitsplan!C147<>\"\",IF(Arbeitsplan!H147<>\"\",Arbeitsplan!H147-Arbeitsplan!G147+1,\"\"),\"\")","v":{"$error":"#N/A"}}]
[{"$f":"IF(C142<>\"\",Arbeitsplan!F148,\"\")","v":""},{"$f":"IF(Arbeitsplan!F148<>\"\",Arbeitsplan!G148,\"\")","v":"00:00:00"},null,null,{"$f":"IF(Arbeitsplan!C148<>\"\",IF(Arbeitsplan!H148<>\"\",Arbeitsplan!H148-Arbeitsplan!G148+1,\"\"),\"\")","v":{"$error":"#N/A"}}]
[{"$f":"IF(C143<>\"\",Arbeitsplan!F149,\"\")","v":""},{"$f":"IF(Arbeitsplan!F149<>\"\",Arbeitsplan!G149,\"\")","v":""},{"$f":"IF(Arbeitsplan!A149<>\"\",IF(Arbeitsplan!H149<>\"\",Arbeitsplan!H149-Arbeitsplan!G149+1,\"\"),\"\")","v":""},{"$f":"IF(Arbeitsplan!B149<>\"\",IF(Arbeitsplan!H149<>\"\",Arbeitsplan!H149-Arbeitsplan!G149+1,\"\"),\"\")","v":""},{"$f":"IF(Arbeitsplan!C149<>\"\",IF(Arbeitsplan!H149<>\"\",Arbeitsplan!H149-Arbeitsplan!G149+1,\"\"),\"\")","v":""}]
[{"$f":"IF(C144<>\"\",Arbeitsplan!F150,\"\")","v":""},{"$f":"IF(Arbeitsplan!F150<>\"\",Arbeitsplan!G150,\"\")","v":{"$error":"#N/A"}},null,{"$f":"IF(Arbeitsplan!B150<>\"\",IF(Arbeitsplan!H150<>\"\",Arbeitsplan!H150-Arbeitsplan!G150+1,\"\"),\"\")","v":{"$error":"#N/A"}},{"$f":"IF(Arbeitsplan!C150<>\"\",IF(Arbeitsplan!H150<>\"\",Arbeitsplan!H150-Arbeitsplan!G150+1,\"\"),\"\")","v":""}]
[{"$f":"IF(C145<>\"\",Arbeitsplan!F151,\"\")","v":""},{"$f":"IF(Arbeitsplan!F151<>\"\",Arbeitsplan!G151,\"\")","v":{"$error":"#N/A"}},null,null,{"$f":"IF(Arbeitsplan!C151<>\"\",IF(Arbeitsplan!H151<>\"\",Arbeitsplan!H151-Arbeitsplan!G151+1,\"\"),\"\")","v":{"$error":"#N/A"}}]
[{"$f":"IF(C146<>\"\",Arbeitsplan!F152,\"\")","v":""},{"$f":"IF(Arbeitsplan!F152<>\"\",Arbeitsplan!G152,\"\")","v":{"$error":"#N/A"}},null,null,{"$f":"IF(Arbeitsplan!C152<>\"\",IF(Arbeitsplan!H152<>\"\",Arbeitsplan!H152-Arbeitsplan!G152+1,\"\"),\"\")","v":{"$error":"#N/A"}}]
[{"$f":"IF(C147<>\"\",Arbeitsplan!F153,\"\")","v":""},{"$f":"IF(Arbeitsplan!F153<>\"\",Arbeitsplan!G153,\"\")","v":{"$error":"#N/A"}},null,null,{"$f":"IF(Arbeitsplan!C153<>\"\",IF(Arbeitsplan!H153<>\"\",Arbeitsplan!H153-Arbeitsplan!G153+1,\"\"),\"\")","v":{"$error":"#N/A"}}]
[{"$f":"IF(C148<>\"\",Arbeitsplan!F154,\"\")","v":""},{"$f":"IF(Arbeitsplan!F154<>\"\",Arbeitsplan!G154,\"\")","v":""},{"$f":"IF(Arbeitsplan!A154<>\"\",IF(Arbeitsplan!H154<>\"\",Arbeitsplan!H154-Arbeitsplan!G154+1,\"\"),\"\")","v":""},{"$f":"IF(Arbeitsplan!B154<>\"\",IF(Arbeitsplan!H154<>\"\",Arbeitsplan!H154-Arbeitsplan!G154+1,\"\"),\"\")","v":""},{"$f":"IF(Arbeitsplan!C154<>\"\",IF(Arbeitsplan!H154<>\"\",Arbeitsplan!H154-Arbeitsplan!G154+1,\"\"),\"\")","v":""}]
[{"$f":"IF(C149<>\"\",Arbeitsplan!F155,\"\")","v":""},{"$f":"IF(Arbeitsplan!F155<>\"\",Arbeitsplan!G155,\"\")","v":{"$error":"#N/A"}},null,{"$f":"IF(Arbeitsplan!B155<>\"\",IF(Arbeitsplan!H155<>\"\",Arbeitsplan!H155-Arbeitsplan!G155+1,\"\"),\"\")","v":{"$error":"#N/A"}},{"$f":"IF(Arbeitsplan!C155<>\"\",IF(Arbeitsplan!H155<>\"\",Arbeitsplan!H155-Arbeitsplan!G155+1,\"\"),\"\")","v":""}]
[{"$f":"IF(C150<>\"\",Arbeitsplan!F156,\"\")","v":""},{"$f":"IF(Arbeitsplan!F156<>\"\",Arbeitsplan!G156,\"\")","v":{"$error":"#N/A"}},null,null,{"$f":"IF(Arbeitsplan!C156<>\"\",IF(Arbeitsplan!H156<>\"\",Arbeitsplan!H156-Arbeitsplan!G156+1,\"\"),\"\")","v":{"$error":"#N/A"}}]
[{"$f":"IF(C151<>\"\",Arbeitsplan!F157,\"\")","v":""},{"$f":"IF(Arbeitsplan!F157<>\"\",Arbeitsplan!G157,\"\")","v":{"$error":"#N/A"}},null,null,{"$f":"IF(Arbeitsplan!C157<>\"\",IF(Arbeitsplan!H157<>\"\",Arbeitsplan!H157-Arbeitsplan!G157+1,\"\"),\"\")","v":{"$error":"#N/A"}}]
[{"$f":"IF(C152<>\"\",Arbeitsplan!F158,\"\")","v":""},{"$f":"IF(Arbeitsplan!F158<>\"\",Arbeitsplan!G158,\"\")","v":{"$error":"#N/A"}},null,null,{"$f":"IF(Arbeitsplan!C158<>\"\",IF(Arbeitsplan!H158<>\"\",Arbeitsplan!H158-Arbeitsplan!G158+1,\"\"),\"\")","v":{"$error":"#N/A"}}]
[{"$f":"IF(C153<>\"\",Arbeitsplan!F159,\"\")","v":""},{"$f":"IF(Arbeitsplan!F159<>\"\",Arbeitsplan!G159,\"\")","v":""},{"$f":"IF(Arbeitsplan!A159<>\"\",IF(Arbeitsplan!H159<>\"\",Arbeitsplan!H159-Arbeitsplan!G159+1,\"\"),\"\")","v":""},{"$f":"IF(Arbeitsplan!B159<>\"\",IF(Arbeitsplan!H159<>\"\",Arbeitsplan!H159-Arbeitsplan!G159+1,\"\"),\"\")","v":""},{"$f":"IF(Arbeitsplan!C159<>\"\",IF(Arbeitsplan!H159<>\"\",Arbeitsplan!H159-Arbeitsplan!G159+1,\"\"),\"\")","v":""}]
[{"$f":"IF(C154<>\"\",Arbeitsplan!F160,\"\")","v":""},{"$f":"IF(Arbeitsplan!F160<>\"\",Arbeitsplan!G160,\"\")","v":{"$error":"#N/A"}},null,{"$f":"IF(Arbeitsplan!B160<>\"\",IF(Arbeitsplan!H160<>\"\",Arbeitsplan!H160-Arbeitsplan!G160+1,\"\"),\"\")","v":{"$error":"#N/A"}},{"$f":"IF(Arbeitsplan!C160<>\"\",IF(Arbeitsplan!H160<>\"\",Arbeitsplan!H160-Arbeitsplan!G160+1,\"\"),\"\")","v":""}]
[{"$f":"IF(C155<>\"\",Arbeitsplan!F161,\"\")","v":""},{"$f":"IF(Arbeitsplan!F161<>\"\",Arbeitsplan!G161,\"\")","v":{"$error":"#N/A"}},null,null,{"$f":"IF(Arbeitsplan!C161<>\"\",IF(Arbeitsplan!H161<>\"\",Arbeitsplan!H161-Arbeitsplan!G161+1,\"\"),\"\")","v":{"$error":"#N/A"}}]
[{"$f":"IF(C156<>\"\",Arbeitsplan!F162,\"\")","v":""},{"$f":"IF(Arbeitsplan!F162<>\"\",Arbeitsplan!G162,\"\")","v":{"$error":"#N/A"}},null,null,{"$f":"IF(Arbeitsplan!C162<>\"\",IF(Arbeitsplan!H162<>\"\",Arbeitsplan!H162-Arbeitsplan!G162+1,\"\"),\"\")","v":{"$error":"#N/A"}}]
[{"$f":"IF(C157<>\"\",Arbeitsplan!F163,\"\")","v":""},{"$f":"IF(Arbeitsplan!F163<>\"\",Arbeitsplan!G163,\"\")","v":{"$error":"#N/A"}},null,null,{"$f":"IF(Arbeitsplan!C163<>\"\",IF(Arbeitsplan!H163<>\"\",Arbeitsplan!H163-Arbeitsplan!G163+1,\"\"),\"\")","v":{"$error":"#N/A"}}]
[{"$f":"IF(C158<>\"\",Arbeitsplan!F164,\"\")","v":""},{"$f":"IF(Arbeitsplan!F164<>\"\",Arbeitsplan!G164,\"\")","v":""}]
[{"$f":"IF(C159<>\"\",Arbeitsplan!F165,\"\")","v":""},{"$f":"IF(Arbeitsplan!F165<>\"\",Arbeitsplan!G165,\"\")","v":""}]
[{"$f":"IF(C160<>\"\",Arbeitsplan!#REF!,\"\")","v":{"$error":"#REF!"}},{"$f":"IF(Arbeitsplan!#REF!<>\"\",Arbeitsplan!#REF!,\"\")","v":{"$error":"#REF!"}},{"$f":"IF(Arbeitsplan!#REF!<>\"\",IF(Arbeitsplan!#REF!<>\"\",Arbeitsplan!#REF!-Arbeitsplan!#REF!+1,\"\"),\"\")","v":{"$error":"#REF!"}},{"$f":"IF(Arbeitsplan!#REF!<>\"\",IF(Arbeitsplan!#REF!<>\"\",Arbeitsplan!#REF!-Arbeitsplan!#REF!+1,\"\"),\"\")","v":{"$error":"#REF!"}},{"$f":"IF(Arbeitsplan!#REF!<>\"\",IF(Arbeitsplan!#REF!<>\"\",Arbeitsplan!#REF!-Arbeitsplan!#REF!+1,\"\"),\"\")","v":{"$error":"#REF!"}}]
[{"$f":"IF(C161<>\"\",Arbeitsplan!F166,\"\")","v":{"$error":"#N/A"}},{"$f":"IF(Arbeitsplan!F166<>\"\",Arbeitsplan!G166,\"\")","v":{"$error":"#N/A"}},{"$f":"IF(Arbeitsplan!A166<>\"\",IF(Arbeitsplan!H166<>\"\",Arbeitsplan!H166-Arbeitsplan!G166+1,\"\"),\"\")","v":{"$error":"#N/A"}},{"$f":"IF(Arbeitsplan!B166<>\"\",IF(Arbeitsplan!H166<>\"\",Arbeitsplan!H166-Arbeitsplan!G166+1,\"\"),\"\")","v":""},{"$f":"IF(Arbeitsplan!C166<>\"\",IF(Arbeitsplan!H166<>\"\",Arbeitsplan!H166-Arbeitsplan!G166+1,\"\"),\"\")","v":""}]
[{"$f":"IF(C162<>\"\",Arbeitsplan!F167,\"\")","v":""},{"$f":"IF(Arbeitsplan!F167<>\"\",Arbeitsplan!G167,\"\")","v":"00:00:00"},null,{"$f":"IF(Arbeitsplan!B167<>\"\",IF(Arbeitsplan!H167<>\"\",Arbeitsplan!H167-Arbeitsplan!G167+1,\"\"),\"\")","v":{"$error":"#N/A"}},{"$f":"IF(Arbeitsplan!C167<>\"\",IF(Arbeitsplan!H167<>\"\",Arbeitsplan!H167-Arbeitsplan!G167+1,\"\"),\"\")","v":""}]
[{"$f":"IF(C163<>\"\",Arbeitsplan!F168,\"\")","v":""},{"$f":"IF(Arbeitsplan!F168<>\"\",Arbeitsplan!G168,\"\")","v":"00:00:00"},null,null,{"$f":"IF(Arbeitsplan!C168<>\"\",IF(Arbeitsplan!H168<>\"\",Arbeitsplan!H168-Arbeitsplan!G168+1,\"\"),\"\")","v":{"$error":"#N/A"}}]
[{"$f":"IF(C164<>\"\",Arbeitsplan!F169,\"\")","v":""},{"$f":"IF(Arbeitsplan!F169<>\"\",Arbeitsplan!G169,\"\")","v":"00:00:00"},null,null,{"$f":"IF(Arbeitsplan!C169<>\"\",IF(Arbeitsplan!H169<>\"\",Arbeitsplan!H169-Arbeitsplan!G169+1,\"\"),\"\")","v":{"$error":"#N/A"}}]
[{"$f":"IF(C165<>\"\",Arbeitsplan!F170,\"\")","v":""},{"$f":"IF(Arbeitsplan!F170<>\"\",Arbeitsplan!G170,\"\")","v":"00:00:00"},null,null,{"$f":"IF(Arbeitsplan!C170<>\"\",IF(Arbeitsplan!H170<>\"\",Arbeitsplan!H170-Arbeitsplan!G170+1,\"\"),\"\")","v":{"$error":"#N/A"}}]
[{"$f":"IF(C166<>\"\",Arbeitsplan!F171,\"\")","v":""},{"$f":"IF(Arbeitsplan!F171<>\"\",Arbeitsplan!G171,\"\")","v":""},{"$f":"IF(Arbeitsplan!A171<>\"\",IF(Arbeitsplan!H171<>\"\",Arbeitsplan!H171-Arbeitsplan!G171+1,\"\"),\"\")","v":""},{"$f":"IF(Arbeitsplan!B171<>\"\",IF(Arbeitsplan!H171<>\"\",Arbeitsplan!H171-Arbeitsplan!G171+1,\"\"),\"\")","v":""},{"$f":"IF(Arbeitsplan!C171<>\"\",IF(Arbeitsplan!H171<>\"\",Arbeitsplan!H171-Arbeitsplan!G171+1,\"\"),\"\")","v":""}]
[{"$f":"IF(C167<>\"\",Arbeitsplan!F172,\"\")","v":""},{"$f":"IF(Arbeitsplan!F172<>\"\",Arbeitsplan!G172,\"\")","v":{"$error":"#N/A"}},null,{"$f":"IF(Arbeitsplan!B172<>\"\",IF(Arbeitsplan!H172<>\"\",Arbeitsplan!H172-Arbeitsplan!G172+1,\"\"),\"\")","v":{"$error":"#N/A"}},{"$f":"IF(Arbeitsplan!C172<>\"\",IF(Arbeitsplan!H172<>\"\",Arbeitsplan!H172-Arbeitsplan!G172+1,\"\"),\"\")","v":""}]
[{"$f":"IF(C168<>\"\",Arbeitsplan!F173,\"\")","v":""},{"$f":"IF(Arbeitsplan!F173<>\"\",Arbeitsplan!G173,\"\")","v":{"$error":"#N/A"}},null,null,{"$f":"IF(Arbeitsplan!C173<>\"\",IF(Arbeitsplan!H173<>\"\",Arbeitsplan!H173-Arbeitsplan!G173+1,\"\"),\"\")","v":{"$error":"#N/A"}}]
[{"$f":"IF(C169<>\"\",Arbeitsplan!F174,\"\")","v":""},{"$f":"IF(Arbeitsplan!F174<>\"\",Arbeitsplan!G174,\"\")","v":{"$error":"#N/A"}},null,null,{"$f":"IF(Arbeitsplan!C174<>\"\",IF(Arbeitsplan!H174<>\"\",Arbeitsplan!H174-Arbeitsplan!G174+1,\"\"),\"\")","v":{"$error":"#N/A"}}]
[{"$f":"IF(C170<>\"\",Arbeitsplan!F175,\"\")","v":""},{"$f":"IF(Arbeitsplan!F175<>\"\",Arbeitsplan!G175,\"\")","v":{"$error":"#N/A"}},null,null,{"$f":"IF(Arbeitsplan!C175<>\"\",IF(Arbeitsplan!H175<>\"\",Arbeitsplan!H175-Arbeitsplan!G175+1,\"\"),\"\")","v":{"$error":"#N/A"}}]
[{"$f":"IF(C171<>\"\",Arbeitsplan!F176,\"\")","v":""},{"$f":"IF(Arbeitsplan!F176<>\"\",Arbeitsplan!G176,\"\")","v":""},{"$f":"IF(Arbeitsplan!A176<>\"\",IF(Arbeitsplan!H176<>\"\",Arbeitsplan!H176-Arbeitsplan!G176+1,\"\"),\"\")","v":""},{"$f":"IF(Arbeitsplan!B176<>\"\",IF(Arbeitsplan!H176<>\"\",Arbeitsplan!H176-Arbeitsplan!G176+1,\"\"),\"\")","v":""},{"$f":"IF(Arbeitsplan!C176<>\"\",IF(Arbeitsplan!H176<>\"\",Arbeitsplan!H176-Arbeitsplan!G176+1,\"\"),\"\")","v":""}]
[{"$f":"IF(C172<>\"\",Arbeitsplan!F177,\"\")","v":""},{"$f":"IF(Arbeitsplan!F177<>\"\",Arbeitsplan!G177,\"\")","v":{"$error":"#N/A"}},null,{"$f":"IF(Arbeitsplan!B177<>\"\",IF(Arbeitsplan!H177<>\"\",Arbeitsplan!H177-Arbeitsplan!G177+1,\"\"),\"\")","v":{"$error":"#N/A"}},{"$f":"IF(Arbeitsplan!C177<>\"\",IF(Arbeitsplan!H177<>\"\",Arbeitsplan!H177-Arbeitsplan!G177+1,\"\"),\"\")","v":""}]
[{"$f":"IF(C173<>\"\",Arbeitsplan!F178,\"\")","v":""},{"$f":"IF(Arbeitsplan!F178<>\"\",Arbeitsplan!G178,\"\")","v":{"$error":"#N/A"}},null,null,{"$f":"IF(Arbeitsplan!C178<>\"\",IF(Arbeitsplan!H178<>\"\",Arbeitsplan!H178-Arbeitsplan!G178+1,\"\"),\"\")","v":{"$error":"#N/A"}}]
[{"$f":"IF(C174<>\"\",Arbeitsplan!F179,\"\")","v":""},{"$f":"IF(Arbeitsplan!F179<>\"\",Arbeitsplan!G179,\"\")","v":{"$error":"#N/A"}},null,null,{"$f":"IF(Arbeitsplan!C179<>\"\",IF(Arbeitsplan!H179<>\"\",Arbeitsplan!H179-Arbeitsplan!G179+1,\"\"),\"\")","v":{"$error":"#N/A"}}]
[{"$f":"IF(C175<>\"\",Arbeitsplan!F180,\"\")","v":""},{"$f":"IF(Arbeitsplan!F180<>\"\",Arbeitsplan!G180,\"\")","v":{"$error":"#N/A"}},null,null,{"$f":"IF(Arbeitsplan!C180<>\"\",IF(Arbeitsplan!H180<>\"\",Arbeitsplan!H180-Arbeitsplan!G180+1,\"\"),\"\")","v":{"$error":"#N/A"}}]
[{"$f":"IF(C176<>\"\",Arbeitsplan!F181,\"\")","v":""},{"$f":"IF(Arbeitsplan!F181<>\"\",Arbeitsplan!G181,\"\")","v":""},{"$f":"IF(Arbeitsplan!A181<>\"\",IF(Arbeitsplan!H181<>\"\",Arbeitsplan!H181-Arbeitsplan!G181+1,\"\"),\"\")","v":""},{"$f":"IF(Arbeitsplan!B181<>\"\",IF(Arbeitsplan!H181<>\"\",Arbeitsplan!H181-Arbeitsplan!G181+1,\"\"),\"\")","v":""},{"$f":"IF(Arbeitsplan!C181<>\"\",IF(Arbeitsplan!H181<>\"\",Arbeitsplan!H181-Arbeitsplan!G181+1,\"\"),\"\")","v":""}]
[{"$f":"IF(C177<>\"\",Arbeitsplan!F182,\"\")","v":""},{"$f":"IF(Arbeitsplan!F182<>\"\",Arbeitsplan!G182,\"\")","v":{"$error":"#N/A"}},null,{"$f":"IF(Arbeitsplan!B182<>\"\",IF(Arbeitsplan!H182<>\"\",Arbeitsplan!H182-Arbeitsplan!G182+1,\"\"),\"\")","v":{"$error":"#N/A"}},{"$f":"IF(Arbeitsplan!C182<>\"\",IF(Arbeitsplan!H182<>\"\",Arbeitsplan!H182-Arbeitsplan!G182+1,\"\"),\"\")","v":""}]
[{"$f":"IF(C178<>\"\",Arbeitsplan!F183,\"\")","v":""},{"$f":"IF(Arbeitsplan!F183<>\"\",Arbeitsplan!G183,\"\")","v":{"$error":"#N/A"}},null,null,{"$f":"IF(Arbeitsplan!C183<>\"\",IF(Arbeitsplan!H183<>\"\",Arbeitsplan!H183-Arbeitsplan!G183+1,\"\"),\"\")","v":{"$error":"#N/A"}}]
[{"$f":"IF(C179<>\"\",Arbeitsplan!F184,\"\")","v":""},{"$f":"IF(Arbeitsplan!F184<>\"\",Arbeitsplan!G184,\"\")","v":{"$error":"#N/A"}},null,null,{"$f":"IF(Arbeitsplan!C184<>\"\",IF(Arbeitsplan!H184<>\"\",Arbeitsplan!H184-Arbeitsplan!G184+1,\"\"),\"\")","v":{"$error":"#N/A"}}]
[{"$f":"IF(C180<>\"\",Arbeitsplan!F185,\"\")","v":""},{"$f":"IF(Arbeitsplan!F185<>\"\",Arbeitsplan!G185,\"\")","v":{"$error":"#N/A"}},null,null,{"$f":"IF(Arbeitsplan!C185<>\"\",IF(Arbeitsplan!H185<>\"\",Arbeitsplan!H185-Arbeitsplan!G185+1,\"\"),\"\")","v":{"$error":"#N/A"}}]
[{"$f":"IF(C181<>\"\",Arbeitsplan!F186,\"\")","v":""},{"$f":"IF(Arbeitsplan!F186<>\"\",Arbeitsplan!G186,\"\")","v":""}]
[{"$f":"IF(C182<>\"\",Arbeitsplan!F187,\"\")","v":""},{"$f":"IF(Arbeitsplan!F187<>\"\",Arbeitsplan!G187,\"\")","v":""},{"$f":"IF(Arbeitsplan!A187<>\"\",IF(Arbeitsplan!H187<>\"\",Arbeitsplan!H187-Arbeitsplan!G187+1,\"\"),\"\")","v":""},{"$f":"IF(Arbeitsplan!B187<>\"\",IF(Arbeitsplan!H187<>\"\",Arbeitsplan!H187-Arbeitsplan!G187+1,\"\"),\"\")","v":""},{"$f":"IF(Arbeitsplan!C187<>\"\",IF(Arbeitsplan!H187<>\"\",Arbeitsplan!H187-Arbeitsplan!G187+1,\"\"),\"\")","v":""}]
[{"$f":"IF(C183<>\"\",Arbeitsplan!F188,\"\")","v":{"$error":"#N/A"}},{"$f":"IF(Arbeitsplan!F188<>\"\",Arbeitsplan!G188,\"\")","v":{"$error":"#N/A"}},{"$f":"IF(Arbeitsplan!A188<>\"\",IF(Arbeitsplan!H188<>\"\",Arbeitsplan!H188-Arbeitsplan!G188+1,\"\"),\"\")","v":{"$error":"#N/A"}},{"$f":"IF(Arbeitsplan!B188<>\"\",IF(Arbeitsplan!H188<>\"\",Arbeitsplan!H188-Arbeitsplan!G188+1,\"\"),\"\")","v":""},{"$f":"IF(Arbeitsplan!C188<>\"\",IF(Arbeitsplan!H188<>\"\",Arbeitsplan!H188-Arbeitsplan!G188+1,\"\"),\"\")","v":""}]
[{"$f":"IF(C184<>\"\",Arbeitsplan!F189,\"\")","v":""},{"$f":"IF(Arbeitsplan!F189<>\"\",Arbeitsplan!G189,\"\")","v":"00:00:00"},null,{"$f":"IF(Arbeitsplan!B189<>\"\",IF(Arbeitsplan!H189<>\"\",Arbeitsplan!H189-Arbeitsplan!G189+1,\"\"),\"\")","v":{"$error":"#N/A"}},{"$f":"IF(Arbeitsplan!C189<>\"\",IF(Arbeitsplan!H189<>\"\",Arbeitsplan!H189-Arbeitsplan!G189+1,\"\"),\"\")","v":""}]
[{"$f":"IF(C185<>\"\",Arbeitsplan!F190,\"\")","v":""},{"$f":"IF(Arbeitsplan!F190<>\"\",Arbeitsplan!G190,\"\")","v":"00:00:00"},null,null,{"$f":"IF(Arbeitsplan!C190<>\"\",IF(Arbeitsplan!H190<>\"\",Arbeitsplan!H190-Arbeitsplan!G190+1,\"\"),\"\")","v":{"$error":"#N/A"}}]
[{"$f":"IF(C186<>\"\",Arbeitsplan!F191,\"\")","v":""},{"$f":"IF(Arbeitsplan!F191<>\"\",Arbeitsplan!G191,\"\")","v":"00:00:00"},null,null,{"$f":"IF(Arbeitsplan!C191<>\"\",IF(Arbeitsplan!H191<>\"\",Arbeitsplan!H191-Arbeitsplan!G191+1,\"\"),\"\")","v":{"$error":"#N/A"}}]
[{"$f":"IF(C187<>\"\",Arbeitsplan!F192,\"\")","v":""},{"$f":"IF(Arbeitsplan!F192<>\"\",Arbeitsplan!G192,\"\")","v":"00:00:00"},null,null,{"$f":"IF(Arbeitsplan!C192<>\"\",IF(Arbeitsplan!H192<>\"\",Arbeitsplan!H192-Arbeitsplan!G192+1,\"\"),\"\")","v":{"$error":"#N/A"}}]
[{"$f":"IF(C188<>\"\",Arbeitsplan!F193,\"\")","v":""},{"$f":"IF(Arbeitsplan!F193<>\"\",Arbeitsplan!G193,\"\")","v":""},{"$f":"IF(Arbeitsplan!A193<>\"\",IF(Arbeitsplan!H193<>\"\",Arbeitsplan!H193-Arbeitsplan!G193+1,\"\"),\"\")","v":""},{"$f":"IF(Arbeitsplan!B193<>\"\",IF(Arbeitsplan!H193<>\"\",Arbeitsplan!H193-Arbeitsplan!G193+1,\"\"),\"\")","v":""},{"$f":"IF(Arbeitsplan!C193<>\"\",IF(Arbeitsplan!H193<>\"\",Arbeitsplan!H193-Arbeitsplan!G193+1,\"\"),\"\")","v":""}]
[{"$f":"IF(C189<>\"\",Arbeitsplan!F194,\"\")","v":""},{"$f":"IF(Arbeitsplan!F194<>\"\",Arbeitsplan!G194,\"\")","v":{"$error":"#N/A"}},null,{"$f":"IF(Arbeitsplan!B194<>\"\",IF(Arbeitsplan!H194<>\"\",Arbeitsplan!H194-Arbeitsplan!G194+1,\"\"),\"\")","v":{"$error":"#N/A"}},{"$f":"IF(Arbeitsplan!C194<>\"\",IF(Arbeitsplan!H194<>\"\",Arbeitsplan!H194-Arbeitsplan!G194+1,\"\"),\"\")","v":""}]
[{"$f":"IF(C190<>\"\",Arbeitsplan!F195,\"\")","v":""},{"$f":"IF(Arbeitsplan!F195<>\"\",Arbeitsplan!G195,\"\")","v":{"$error":"#N/A"}},null,null,{"$f":"IF(Arbeitsplan!C195<>\"\",IF(Arbeitsplan!H195<>\"\",Arbeitsplan!H195-Arbeitsplan!G195+1,\"\"),\"\")","v":{"$error":"#N/A"}}]
[{"$f":"IF(C191<>\"\",Arbeitsplan!F196,\"\")","v":""},{"$f":"IF(Arbeitsplan!F196<>\"\",Arbeitsplan!G196,\"\")","v":{"$error":"#N/A"}},null,null,{"$f":"IF(Arbeitsplan!C196<>\"\",IF(Arbeitsplan!H196<>\"\",Arbeitsplan!H196-Arbeitsplan!G196+1,\"\"),\"\")","v":{"$error":"#N/A"}}]
[{"$f":"IF(C192<>\"\",Arbeitsplan!F197,\"\")","v":""},{"$f":"IF(Arbeitsplan!F197<>\"\",Arbeitsplan!G197,\"\")","v":{"$error":"#N/A"}},null,null,{"$f":"IF(Arbeitsplan!C197<>\"\",IF(Arbeitsplan!H197<>\"\",Arbeitsplan!H197-Arbeitsplan!G197+1,\"\"),\"\")","v":{"$error":"#N/A"}}]
[{"$f":"IF(C193<>\"\",Arbeitsplan!F198,\"\")","v":""},{"$f":"IF(Arbeitsplan!F198<>\"\",Arbeitsplan!G198,\"\")","v":""},{"$f":"IF(Arbeitsplan!A198<>\"\",IF(Arbeitsplan!H198<>\"\",Arbeitsplan!H198-Arbeitsplan!G198+1,\"\"),\"\")","v":""},{"$f":"IF(Arbeitsplan!B198<>\"\",IF(Arbeitsplan!H198<>\"\",Arbeitsplan!H198-Arbeitsplan!G198+1,\"\"),\"\")","v":""},{"$f":"IF(Arbeitsplan!C198<>\"\",IF(Arbeitsplan!H198<>\"\",Arbeitsplan!H198-Arbeitsplan!G198+1,\"\"),\"\")","v":""}]
[{"$f":"IF(C194<>\"\",Arbeitsplan!F199,\"\")","v":""},{"$f":"IF(Arbeitsplan!F199<>\"\",Arbeitsplan!G199,\"\")","v":{"$error":"#N/A"}},null,{"$f":"IF(Arbeitsplan!B199<>\"\",IF(Arbeitsplan!H199<>\"\",Arbeitsplan!H199-Arbeitsplan!G199+1,\"\"),\"\")","v":{"$error":"#N/A"}},{"$f":"IF(Arbeitsplan!C199<>\"\",IF(Arbeitsplan!H199<>\"\",Arbeitsplan!H199-Arbeitsplan!G199+1,\"\"),\"\")","v":""}]
[{"$f":"IF(C195<>\"\",Arbeitsplan!F200,\"\")","v":""},{"$f":"IF(Arbeitsplan!F200<>\"\",Arbeitsplan!G200,\"\")","v":{"$error":"#N/A"}},null,null,{"$f":"IF(Arbeitsplan!C200<>\"\",IF(Arbeitsplan!H200<>\"\",Arbeitsplan!H200-Arbeitsplan!G200+1,\"\"),\"\")","v":{"$error":"#N/A"}}]
[{"$f":"IF(C196<>\"\",Arbeitsplan!F201,\"\")","v":""},{"$f":"IF(Arbeitsplan!F201<>\"\",Arbeitsplan!G201,\"\")","v":{"$error":"#N/A"}},null,null,{"$f":"IF(Arbeitsplan!C201<>\"\",IF(Arbeitsplan!H201<>\"\",Arbeitsplan!H201-Arbeitsplan!G201+1,\"\"),\"\")","v":{"$error":"#N/A"}}]
[{"$f":"IF(C197<>\"\",Arbeitsplan!F202,\"\")","v":""},{"$f":"IF(Arbeitsplan!F202<>\"\",Arbeitsplan!G202,\"\")","v":{"$error":"#N/A"}},null,null,{"$f":"IF(Arbeitsplan!C202<>\"\",IF(Arbeitsplan!H202<>\"\",Arbeitsplan!H202-Arbeitsplan!G202+1,\"\"),\"\")","v":{"$error":"#N/A"}}]
[{"$f":"IF(C198<>\"\",Arbeitsplan!F203,\"\")","v":""},{"$f":"IF(Arbeitsplan!F203<>\"\",Arbeitsplan!G203,\"\")","v":""},{"$f":"IF(Arbeitsplan!A203<>\"\",IF(Arbeitsplan!H203<>\"\",Arbeitsplan!H203-Arbeitsplan!G203+1,\"\"),\"\")","v":""},{"$f":"IF(Arbeitsplan!B203<>\"\",IF(Arbeitsplan!H203<>\"\",Arbeitsplan!H203-Arbeitsplan!G203+1,\"\"),\"\")","v":""},{"$f":"IF(Arbeitsplan!C203<>\"\",IF(Arbeitsplan!H203<>\"\",Arbeitsplan!H203-Arbeitsplan!G203+1,\"\"),\"\")","v":""}]
[{"$f":"IF(C199<>\"\",Arbeitsplan!F204,\"\")","v":""},{"$f":"IF(Arbeitsplan!F204<>\"\",Arbeitsplan!G204,\"\")","v":{"$error":"#N/A"}},null,{"$f":"IF(Arbeitsplan!B204<>\"\",IF(Arbeitsplan!H204<>\"\",Arbeitsplan!H204-Arbeitsplan!G204+1,\"\"),\"\")","v":{"$error":"#N/A"}},{"$f":"IF(Arbeitsplan!C204<>\"\",IF(Arbeitsplan!H204<>\"\",Arbeitsplan!H204-Arbeitsplan!G204+1,\"\"),\"\")","v":""}]
[{"$f":"IF(C200<>\"\",Arbeitsplan!F205,\"\")","v":""},{"$f":"IF(Arbeitsplan!F205<>\"\",Arbeitsplan!G205,\"\")","v":{"$error":"#N/A"}},null,null,{"$f":"IF(Arbeitsplan!C205<>\"\",IF(Arbeitsplan!H205<>\"\",Arbeitsplan!H205-Arbeitsplan!G205+1,\"\"),\"\")","v":{"$error":"#N/A"}}]
[{"$f":"IF(C201<>\"\",Arbeitsplan!F206,\"\")","v":""},{"$f":"IF(Arbeitsplan!F206<>\"\",Arbeitsplan!G206,\"\")","v":{"$error":"#N/A"}},null,null,{"$f":"IF(Arbeitsplan!C206<>\"\",IF(Arbeitsplan!H206<>\"\",Arbeitsplan!H206-Arbeitsplan!G206+1,\"\"),\"\")","v":{"$error":"#N/A"}}]
[{"$f":"IF(C202<>\"\",Arbeitsplan!F207,\"\")","v":""},{"$f":"IF(Arbeitsplan!F207<>\"\",Arbeitsplan!G207,\"\")","v":{"$error":"#N/A"}},null,null,{"$f":"IF(Arbeitsplan!C207<>\"\",IF(Arbeitsplan!H207<>\"\",Arbeitsplan!H207-Arbeitsplan!G207+1,\"\"),\"\")","v":{"$error":"#N/A"}}]
[{"$f":"IF(C203<>\"\",Arbeitsplan!F208,\"\")","v":""},{"$f":"IF(Arbeitsplan!F208<>\"\",Arbeitsplan!G208,\"\")","v":""}]
[{"$f":"IF(C204<>\"\",Arbeitsplan!F209,\"\")","v":""},{"$f":"IF(Arbeitsplan!F209<>\"\",Arbeitsplan!G209,\"\")","v":""},{"$f":"IF(Arbeitsplan!A209<>\"\",IF(Arbeitsplan!H209<>\"\",Arbeitsplan!H209-Arbeitsplan!G209+1,\"\"),\"\")","v":""},{"$f":"IF(Arbeitsplan!B209<>\"\",IF(Arbeitsplan!H209<>\"\",Arbeitsplan!H209-Arbeitsplan!G209+1,\"\"),\"\")","v":""},{"$f":"IF(Arbeitsplan!C209<>\"\",IF(Arbeitsplan!H209<>\"\",Arbeitsplan!H209-Arbeitsplan!G209+1,\"\"),\"\")","v":""}]
[{"$f":"IF(C205<>\"\",Arbeitsplan!#REF!,\"\")","v":""},{"$f":"IF(Arbeitsplan!#REF!<>\"\",Arbeitsplan!#REF!,\"\")","v":{"$error":"#REF!"}},null,{"$f":"IF(Arbeitsplan!#REF!<>\"\",IF(Arbeitsplan!#REF!<>\"\",Arbeitsplan!#REF!-Arbeitsplan!#REF!+1,\"\"),\"\")","v":{"$error":"#REF!"}},{"$f":"IF(Arbeitsplan!#REF!<>\"\",IF(Arbeitsplan!#REF!<>\"\",Arbeitsplan!#REF!-Arbeitsplan!#REF!+1,\"\"),\"\")","v":{"$error":"#REF!"}}]
[{"$f":"IF(C206<>\"\",Arbeitsplan!F210,\"\")","v":{"$error":"#N/A"}},{"$f":"IF(Arbeitsplan!F210<>\"\",Arbeitsplan!G210,\"\")","v":{"$error":"#N/A"}},{"$f":"IF(Arbeitsplan!A210<>\"\",IF(Arbeitsplan!H210<>\"\",Arbeitsplan!H210-Arbeitsplan!G210+1,\"\"),\"\")","v":{"$error":"#N/A"}},{"$f":"IF(Arbeitsplan!B210<>\"\",IF(Arbeitsplan!H210<>\"\",Arbeitsplan!H210-Arbeitsplan!G210+1,\"\"),\"\")","v":""},{"$f":"IF(Arbeitsplan!C210<>\"\",IF(Arbeitsplan!H210<>\"\",Arbeitsplan!H210-Arbeitsplan!G210+1,\"\"),\"\")","v":""}]
[{"$f":"IF(C207<>\"\",Arbeitsplan!F211,\"\")","v":""},{"$f":"IF(Arbeitsplan!F211<>\"\",Arbeitsplan!G211,\"\")","v":"00:00:00"},null,{"$f":"IF(Arbeitsplan!B211<>\"\",IF(Arbeitsplan!H211<>\"\",Arbeitsplan!H211-Arbeitsplan!G211+1,\"\"),\"\")","v":{"$error":"#N/A"}},{"$f":"IF(Arbeitsplan!C211<>\"\",IF(Arbeitsplan!H211<>\"\",Arbeitsplan!H211-Arbeitsplan!G211+1,\"\"),\"\")","v":""}]
[{"$f":"IF(C208<>\"\",Arbeitsplan!F212,\"\")","v":""},{"$f":"IF(Arbeitsplan!F212<>\"\",Arbeitsplan!G212,\"\")","v":"00:00:00"},null,null,{"$f":"IF(Arbeitsplan!C212<>\"\",IF(Arbeitsplan!H212<>\"\",Arbeitsplan!H212-Arbeitsplan!G212+1,\"\"),\"\")","v":{"$error":"#N/A"}}]
[{"$f":"IF(C209<>\"\",Arbeitsplan!F213,\"\")","v":""},{"$f":"IF(Arbeitsplan!F213<>\"\",Arbeitsplan!G213,\"\")","v":"00:00:00"},null,null,{"$f":"IF(Arbeitsplan!C213<>\"\",IF(Arbeitsplan!H213<>\"\",Arbeitsplan!H213-Arbeitsplan!G213+1,\"\"),\"\")","v":{"$error":"#N/A"}}]
[{"$f":"IF(C210<>\"\",Arbeitsplan!F214,\"\")","v":""},{"$f":"IF(Arbeitsplan!F214<>\"\",Arbeitsplan!G214,\"\")","v":"00:00:00"},null,null,{"$f":"IF(Arbeitsplan!C214<>\"\",IF(Arbeitsplan!H214<>\"\",Arbeitsplan!H214-Arbeitsplan!G214+1,\"\"),\"\")","v":{"$error":"#N/A"}}]
[{"$f":"IF(C211<>\"\",Arbeitsplan!F215,\"\")","v":""},{"$f":"IF(Arbeitsplan!F215<>\"\",Arbeitsplan!G215,\"\")","v":""},{"$f":"IF(Arbeitsplan!A215<>\"\",IF(Arbeitsplan!H215<>\"\",Arbeitsplan!H215-Arbeitsplan!G215+1,\"\"),\"\")","v":""},{"$f":"IF(Arbeitsplan!B215<>\"\",IF(Arbeitsplan!H215<>\"\",Arbeitsplan!H215-Arbeitsplan!G215+1,\"\"),\"\")","v":""},{"$f":"IF(Arbeitsplan!C215<>\"\",IF(Arbeitsplan!H215<>\"\",Arbeitsplan!H215-Arbeitsplan!G215+1,\"\"),\"\")","v":""}]
[{"$f":"IF(C212<>\"\",Arbeitsplan!F216,\"\")","v":""},{"$f":"IF(Arbeitsplan!F216<>\"\",Arbeitsplan!G216,\"\")","v":{"$error":"#N/A"}},null,{"$f":"IF(Arbeitsplan!B216<>\"\",IF(Arbeitsplan!H216<>\"\",Arbeitsplan!H216-Arbeitsplan!G216+1,\"\"),\"\")","v":{"$error":"#N/A"}},{"$f":"IF(Arbeitsplan!C216<>\"\",IF(Arbeitsplan!H216<>\"\",Arbeitsplan!H216-Arbeitsplan!G216+1,\"\"),\"\")","v":""}]
[{"$f":"IF(C213<>\"\",Arbeitsplan!F217,\"\")","v":""},{"$f":"IF(Arbeitsplan!F217<>\"\",Arbeitsplan!G217,\"\")","v":{"$error":"#N/A"}},null,null,{"$f":"IF(Arbeitsplan!C217<>\"\",IF(Arbeitsplan!H217<>\"\",Arbeitsplan!H217-Arbeitsplan!G217+1,\"\"),\"\")","v":{"$error":"#N/A"}}]
[{"$f":"IF(C214<>\"\",Arbeitsplan!F218,\"\")","v":""},{"$f":"IF(Arbeitsplan!F218<>\"\",Arbeitsplan!G218,\"\")","v":{"$error":"#N/A"}},null,null,{"$f":"IF(Arbeitsplan!C218<>\"\",IF(Arbeitsplan!H218<>\"\",Arbeitsplan!H218-Arbeitsplan!G218+1,\"\"),\"\")","v":{"$error":"#N/A"}}]
[{"$f":"IF(C215<>\"\",Arbeitsplan!F219,\"\")","v":""},{"$f":"IF(Arbeitsplan!F219<>\"\",Arbeitsplan!G219,\"\")","v":{"$error":"#N/A"}},null,null,{"$f":"IF(Arbeitsplan!C219<>\"\",IF(Arbeitsplan!H219<>\"\",Arbeitsplan!H219-Arbeitsplan!G219+1,\"\"),\"\")","v":{"$error":"#N/A"}}]
[{"$f":"IF(C216<>\"\",Arbeitsplan!F220,\"\")","v":""},{"$f":"IF(Arbeitsplan!F220<>\"\",Arbeitsplan!G220,\"\")","v":""},{"$f":"IF(Arbeitsplan!A220<>\"\",IF(Arbeitsplan!H220<>\"\",Arbeitsplan!H220-Arbeitsplan!G220+1,\"\"),\"\")","v":""},{"$f":"IF(Arbeitsplan!B220<>\"\",IF(Arbeitsplan!H220<>\"\",Arbeitsplan!H220-Arbeitsplan!G220+1,\"\"),\"\")","v":""},{"$f":"IF(Arbeitsplan!C220<>\"\",IF(Arbeitsplan!H220<>\"\",Arbeitsplan!H220-Arbeitsplan!G220+1,\"\"),\"\")","v":""}]
[{"$f":"IF(C217<>\"\",Arbeitsplan!F221,\"\")","v":""},{"$f":"IF(Arbeitsplan!F221<>\"\",Arbeitsplan!G221,\"\")","v":{"$error":"#N/A"}},null,{"$f":"IF(Arbeitsplan!B221<>\"\",IF(Arbeitsplan!H221<>\"\",Arbeitsplan!H221-Arbeitsplan!G221+1,\"\"),\"\")","v":{"$error":"#N/A"}},{"$f":"IF(Arbeitsplan!C221<>\"\",IF(Arbeitsplan!H221<>\"\",Arbeitsplan!H221-Arbeitsplan!G221+1,\"\"),\"\")","v":""}]
[{"$f":"IF(C218<>\"\",Arbeitsplan!F222,\"\")","v":""},{"$f":"IF(Arbeitsplan!F222<>\"\",Arbeitsplan!G222,\"\")","v":{"$error":"#N/A"}},null,null,{"$f":"IF(Arbeitsplan!C222<>\"\",IF(Arbeitsplan!H222<>\"\",Arbeitsplan!H222-Arbeitsplan!G222+1,\"\"),\"\")","v":{"$error":"#N/A"}}]
[{"$f":"IF(C219<>\"\",Arbeitsplan!F223,\"\")","v":""},{"$f":"IF(Arbeitsplan!F223<>\"\",Arbeitsplan!G223,\"\")","v":{"$error":"#N/A"}},null,null,{"$f":"IF(Arbeitsplan!C223<>\"\",IF(Arbeitsplan!H223<>\"\",Arbeitsplan!H223-Arbeitsplan!G223+1,\"\"),\"\")","v":{"$error":"#N/A"}}]
[{"$f":"IF(C220<>\"\",Arbeitsplan!F224,\"\")","v":""},{"$f":"IF(Arbeitsplan!F224<>\"\",Arbeitsplan!G224,\"\")","v":{"$error":"#N/A"}},null,null,{"$f":"IF(Arbeitsplan!C224<>\"\",IF(Arbeitsplan!H224<>\"\",Arbeitsplan!H224-Arbeitsplan!G224+1,\"\"),\"\")","v":{"$error":"#N/A"}}]
[{"$f":"IF(C221<>\"\",Arbeitsplan!F225,\"\")","v":""},{"$f":"IF(Arbeitsplan!F225<>\"\",Arbeitsplan!G225,\"\")","v":""},{"$f":"IF(Arbeitsplan!A225<>\"\",IF(Arbeitsplan!H225<>\"\",Arbeitsplan!H225-Arbeitsplan!G225+1,\"\"),\"\")","v":""},{"$f":"IF(Arbeitsplan!B225<>\"\",IF(Arbeitsplan!H225<>\"\",Arbeitsplan!H225-Arbeitsplan!G225+1,\"\"),\"\")","v":""},{"$f":"IF(Arbeitsplan!C225<>\"\",IF(Arbeitsplan!H225<>\"\",Arbeitsplan!H225-Arbeitsplan!G225+1,\"\"),\"\")","v":""}]
[{"$f":"IF(C222<>\"\",Arbeitsplan!F226,\"\")","v":""},{"$f":"IF(Arbeitsplan!F226<>\"\",Arbeitsplan!G226,\"\")","v":{"$error":"#N/A"}},null,{"$f":"IF(Arbeitsplan!B226<>\"\",IF(Arbeitsplan!H226<>\"\",Arbeitsplan!H226-Arbeitsplan!G226+1,\"\"),\"\")","v":{"$error":"#N/A"}},{"$f":"IF(Arbeitsplan!C226<>\"\",IF(Arbeitsplan!H226<>\"\",Arbeitsplan!H226-Arbeitsplan!G226+1,\"\"),\"\")","v":""}]
[{"$f":"IF(C223<>\"\",Arbeitsplan!F227,\"\")","v":""},{"$f":"IF(Arbeitsplan!F227<>\"\",Arbeitsplan!G227,\"\")","v":{"$error":"#N/A"}},null,null,{"$f":"IF(Arbeitsplan!C227<>\"\",IF(Arbeitsplan!H227<>\"\",Arbeitsplan!H227-Arbeitsplan!G227+1,\"\"),\"\")","v":{"$error":"#N/A"}}]
[{"$f":"IF(C224<>\"\",Arbeitsplan!F228,\"\")","v":""},{"$f":"IF(Arbeitsplan!F228<>\"\",Arbeitsplan!G228,\"\")","v":{"$error":"#N/A"}},null,null,{"$f":"IF(Arbeitsplan!C228<>\"\",IF(Arbeitsplan!H228<>\"\",Arbeitsplan!H228-Arbeitsplan!G228+1,\"\"),\"\")","v":{"$error":"#N/A"}}]
[{"$f":"IF(C225<>\"\",Arbeitsplan!F229,\"\")","v":""},{"$f":"IF(Arbeitsplan!F229<>\"\",Arbeitsplan!G229,\"\")","v":{"$error":"#N/A"}},null,null,{"$f":"IF(Arbeitsplan!C229<>\"\",IF(Arbeitsplan!H229<>\"\",Arbeitsplan!H229-Arbeitsplan!G229+1,\"\"),\"\")","v":{"$error":"#N/A"}}]
[{"$f":"IF(C226<>\"\",Arbeitsplan!F230,\"\")","v":""},{"$f":"IF(Arbeitsplan!F230<>\"\",Arbeitsplan!G230,\"\")","v":""},{"$f":"IF(Arbeitsplan!A230<>\"\",IF(Arbeitsplan!H230<>\"\",Arbeitsplan!H230-Arbeitsplan!G230+1,\"\"),\"\")","v":""},{"$f":"IF(Arbeitsplan!B230<>\"\",IF(Arbeitsplan!H230<>\"\",Arbeitsplan!H230-Arbeitsplan!G230+1,\"\"),\"\")","v":""},{"$f":"IF(Arbeitsplan!C230<>\"\",IF(Arbeitsplan!H230<>\"\",Arbeitsplan!H230-Arbeitsplan!G230+1,\"\"),\"\")","v":""}]
[{"$f":"IF(C227<>\"\",Arbeitsplan!F231,\"\")","v":""},{"$f":"IF(Arbeitsplan!F231<>\"\",Arbeitsplan!G231,\"\")","v":""},null,{"$f":"IF(Arbeitsplan!B231<>\"\",IF(Arbeitsplan!H231<>\"\",Arbeitsplan!H231-Arbeitsplan!G231+1,\"\"),\"\")","v":""},{"$f":"IF(Arbeitsplan!C231<>\"\",IF(Arbeitsplan!H231<>\"\",Arbeitsplan!H231-Arbeitsplan!G231+1,\"\"),\"\")","v":""}]
[{"$f":"IF(C228<>\"\",Arbeitsplan!F232,\"\")","v":{"$error":"#N/A"}},{"$f":"IF(Arbeitsplan!F232<>\"\",Arbeitsplan!G232,\"\")","v":{"$error":"#N/A"}},{"$f":"IF(Arbeitsplan!A232<>\"\",IF(Arbeitsplan!H232<>\"\",Arbeitsplan!H232-Arbeitsplan!G232+1,\"\"),\"\")","v":{"$error":"#N/A"}},{"$f":"IF(Arbeitsplan!B232<>\"\",IF(Arbeitsplan!H232<>\"\",Arbeitsplan!H232-Arbeitsplan!G232+1,\"\"),\"\")","v":""},{"$f":"IF(Arbeitsplan!C232<>\"\",IF(Arbeitsplan!H232<>\"\",Arbeitsplan!H232-Arbeitsplan!G232+1,\"\"),\"\")","v":""}]
[{"$f":"IF(C229<>\"\",Arbeitsplan!F233,\"\")","v":""},{"$f":"IF(Arbeitsplan!F233<>\"\",Arbeitsplan!G233,\"\")","v":"00:00:00"},null,{"$f":"IF(Arbeitsplan!B233<>\"\",IF(Arbeitsplan!H233<>\"\",Arbeitsplan!H233-Arbeitsplan!G233+1,\"\"),\"\")","v":{"$error":"#N/A"}},{"$f":"IF(Arbeitsplan!C233<>\"\",IF(Arbeitsplan!H233<>\"\",Arbeitsplan!H233-Arbeitsplan!G233+1,\"\"),\"\")","v":""}]
[{"$f":"IF(C230<>\"\",Arbeitsplan!F234,\"\")","v":""},{"$f":"IF(Arbeitsplan!F234<>\"\",Arbeitsplan!G234,\"\")","v":"00:00:00"},null,null,{"$f":"IF(Arbeitsplan!C234<>\"\",IF(Arbeitsplan!H234<>\"\",Arbeitsplan!H234-Arbeitsplan!G234+1,\"\"),\"\")","v":{"$error":"#N/A"}}]
[{"$f":"IF(C231<>\"\",Arbeitsplan!F235,\"\")","v":""},{"$f":"IF(Arbeitsplan!F235<>\"\",Arbeitsplan!G235,\"\")","v":"00:00:00"},null,null,{"$f":"IF(Arbeitsplan!C235<>\"\",IF(Arbeitsplan!H235<>\"\",Arbeitsplan!H235-Arbeitsplan!G235+1,\"\"),\"\")","v":{"$error":"#N/A"}}]
[{"$f":"IF(C232<>\"\",Arbeitsplan!F236,\"\")","v":""},{"$f":"IF(Arbeitsplan!F236<>\"\",Arbeitsplan!G236,\"\")","v":"00:00:00"},null,null,{"$f":"IF(Arbeitsplan!C236<>\"\",IF(Arbeitsplan!H236<>\"\",Arbeitsplan!H236-Arbeitsplan!G236+1,\"\"),\"\")","v":{"$error":"#N/A"}}]
[{"$f":"IF(C233<>\"\",Arbeitsplan!F237,\"\")","v":""},{"$f":"IF(Arbeitsplan!F237<>\"\",Arbeitsplan!G237,\"\")","v":""},{"$f":"IF(Arbeitsplan!A237<>\"\",IF(Arbeitsplan!H237<>\"\",Arbeitsplan!H237-Arbeitsplan!G237+1,\"\"),\"\")","v":""},{"$f":"IF(Arbeitsplan!B237<>\"\",IF(Arbeitsplan!H237<>\"\",Arbeitsplan!H237-Arbeitsplan!G237+1,\"\"),\"\")","v":""},{"$f":"IF(Arbeitsplan!C237<>\"\",IF(Arbeitsplan!H237<>\"\",Arbeitsplan!H237-Arbeitsplan!G237+1,\"\"),\"\")","v":""}]
[{"$f":"IF(C234<>\"\",Arbeitsplan!F238,\"\")","v":""},{"$f":"IF(Arbeitsplan!F238<>\"\",Arbeitsplan!G238,\"\")","v":{"$error":"#N/A"}},null,{"$f":"IF(Arbeitsplan!B238<>\"\",IF(Arbeitsplan!H238<>\"\",Arbeitsplan!H238-Arbeitsplan!G238+1,\"\"),\"\")","v":{"$error":"#N/A"}},{"$f":"IF(Arbeitsplan!C238<>\"\",IF(Arbeitsplan!H238<>\"\",Arbeitsplan!H238-Arbeitsplan!G238+1,\"\"),\"\")","v":""}]
[{"$f":"IF(C235<>\"\",Arbeitsplan!F239,\"\")","v":""},{"$f":"IF(Arbeitsplan!F239<>\"\",Arbeitsplan!G239,\"\")","v":{"$error":"#N/A"}},null,null,{"$f":"IF(Arbeitsplan!C239<>\"\",IF(Arbeitsplan!H239<>\"\",Arbeitsplan!H239-Arbeitsplan!G239+1,\"\"),\"\")","v":{"$error":"#N/A"}}]
[{"$f":"IF(C236<>\"\",Arbeitsplan!F240,\"\")","v":""},{"$f":"IF(Arbeitsplan!F240<>\"\",Arbeitsplan!G240,\"\")","v":{"$error":"#N/A"}},null,null,{"$f":"IF(Arbeitsplan!C240<>\"\",IF(Arbeitsplan!H240<>\"\",Arbeitsplan!H240-Arbeitsplan!G240+1,\"\"),\"\")","v":{"$error":"#N/A"}}]
[{"$f":"IF(C237<>\"\",Arbeitsplan!F241,\"\")","v":""},{"$f":"IF(Arbeitsplan!F241<>\"\",Arbeitsplan!G241,\"\")","v":{"$error":"#N/A"}},null,null,{"$f":"IF(Arbeitsplan!C241<>\"\",IF(Arbeitsplan!H241<>\"\",Arbeitsplan!H241-Arbeitsplan!G241+1,\"\"),\"\")","v":{"$error":"#N/A"}}]
[{"$f":"IF(C238<>\"\",Arbeitsplan!F242,\"\")","v":""},{"$f":"IF(Arbeitsplan!F242<>\"\",Arbeitsplan!G242,\"\")","v":""},{"$f":"IF(Arbeitsplan!A242<>\"\",IF(Arbeitsplan!H242<>\"\",Arbeitsplan!H242-Arbeitsplan!G242+1,\"\"),\"\")","v":""},{"$f":"IF(Arbeitsplan!B242<>\"\",IF(Arbeitsplan!H242<>\"\",Arbeitsplan!H242-Arbeitsplan!G242+1,\"\"),\"\")","v":""},{"$f":"IF(Arbeitsplan!C242<>\"\",IF(Arbeitsplan!H242<>\"\",Arbeitsplan!H242-Arbeitsplan!G242+1,\"\"),\"\")","v":""}]
[{"$f":"IF(C239<>\"\",Arbeitsplan!F243,\"\")","v":""},{"$f":"IF(Arbeitsplan!F243<>\"\",Arbeitsplan!G243,\"\")","v":{"$error":"#N/A"}},null,{"$f":"IF(Arbeitsplan!B243<>\"\",IF(Arbeitsplan!H243<>\"\",Arbeitsplan!H243-Arbeitsplan!G243+1,\"\"),\"\")","v":{"$error":"#N/A"}},{"$f":"IF(Arbeitsplan!C243<>\"\",IF(Arbeitsplan!H243<>\"\",Arbeitsplan!H243-Arbeitsplan!G243+1,\"\"),\"\")","v":""}]
[{"$f":"IF(C240<>\"\",Arbeitsplan!F244,\"\")","v":""},{"$f":"IF(Arbeitsplan!F244<>\"\",Arbeitsplan!G244,\"\")","v":{"$error":"#N/A"}},null,null,{"$f":"IF(Arbeitsplan!C244<>\"\",IF(Arbeitsplan!H244<>\"\",Arbeitsplan!H244-Arbeitsplan!G244+1,\"\"),\"\")","v":{"$error":"#N/A"}}]
[{"$f":"IF(C241<>\"\",Arbeitsplan!F245,\"\")","v":""},{"$f":"IF(Arbeitsplan!F245<>\"\",Arbeitsplan!G245,\"\")","v":{"$error":"#N/A"}},null,null,{"$f":"IF(Arbeitsplan!C245<>\"\",IF(Arbeitsplan!H245<>\"\",Arbeitsplan!H245-Arbeitsplan!G245+1,\"\"),\"\")","v":{"$error":"#N/A"}}]
[{"$f":"IF(C242<>\"\",Arbeitsplan!F246,\"\")","v":""},{"$f":"IF(Arbeitsplan!F246<>\"\",Arbeitsplan!G246,\"\")","v":{"$error":"#N/A"}},null,null,{"$f":"IF(Arbeitsplan!C246<>\"\",IF(Arbeitsplan!H246<>\"\",Arbeitsplan!H246-Arbeitsplan!G246+1,\"\"),\"\")","v":{"$error":"#N/A"}}]
[{"$f":"IF(C243<>\"\",Arbeitsplan!F247,\"\")","v":""},{"$f":"IF(Arbeitsplan!F247<>\"\",Arbeitsplan!G247,\"\")","v":""},{"$f":"IF(Arbeitsplan!A247<>\"\",IF(Arbeitsplan!H247<>\"\",Arbeitsplan!H247-Arbeitsplan!G247+1,\"\"),\"\")","v":""},{"$f":"IF(Arbeitsplan!B247<>\"\",IF(Arbeitsplan!H247<>\"\",Arbeitsplan!H247-Arbeitsplan!G247+1,\"\"),\"\")","v":""},{"$f":"IF(Arbeitsplan!C247<>\"\",IF(Arbeitsplan!H247<>\"\",Arbeitsplan!H247-Arbeitsplan!G247+1,\"\"),\"\")","v":""}]
[{"$f":"IF(C244<>\"\",Arbeitsplan!F248,\"\")","v":""},{"$f":"IF(Arbeitsplan!F248<>\"\",Arbeitsplan!G248,\"\")","v":{"$error":"#N/A"}},null,{"$f":"IF(Arbeitsplan!B248<>\"\",IF(Arbeitsplan!H248<>\"\",Arbeitsplan!H248-Arbeitsplan!G248+1,\"\"),\"\")","v":{"$error":"#N/A"}},{"$f":"IF(Arbeitsplan!C248<>\"\",IF(Arbeitsplan!H248<>\"\",Arbeitsplan!H248-Arbeitsplan!G248+1,\"\"),\"\")","v":""}]
[{"$f":"IF(C245<>\"\",Arbeitsplan!F249,\"\")","v":""},{"$f":"IF(Arbeitsplan!F249<>\"\",Arbeitsplan!G249,\"\")","v":{"$error":"#N/A"}},null,null,{"$f":"IF(Arbeitsplan!C249<>\"\",IF(Arbeitsplan!H249<>\"\",Arbeitsplan!H249-Arbeitsplan!G249+1,\"\"),\"\")","v":{"$error":"#N/A"}}]
[{"$f":"IF(C246<>\"\",Arbeitsplan!F250,\"\")","v":""},{"$f":"IF(Arbeitsplan!F250<>\"\",Arbeitsplan!G250,\"\")","v":{"$error":"#N/A"}},null,null,{"$f":"IF(Arbeitsplan!C250<>\"\",IF(Arbeitsplan!H250<>\"\",Arbeitsplan!H250-Arbeitsplan!G250+1,\"\"),\"\")","v":{"$error":"#N/A"}}]
[{"$f":"IF(C247<>\"\",Arbeitsplan!F251,\"\")","v":""},{"$f":"IF(Arbeitsplan!F251<>\"\",Arbeitsplan!G251,\"\")","v":{"$error":"#N/A"}},null,null,{"$f":"IF(Arbeitsplan!C251<>\"\",IF(Arbeitsplan!H251<>\"\",Arbeitsplan!H251-Arbeitsplan!G251+1,\"\"),\"\")","v":{"$error":"#N/A"}}]
[{"$f":"IF(C248<>\"\",Arbeitsplan!F252,\"\")","v":""},{"$f":"IF(Arbeitsplan!F252<>\"\",Arbeitsplan!G252,\"\")","v":""},{"$f":"IF(Arbeitsplan!A252<>\"\",IF(Arbeitsplan!H252<>\"\",Arbeitsplan!H252-Arbeitsplan!G252+1,\"\"),\"\")","v":""},{"$f":"IF(Arbeitsplan!B252<>\"\",IF(Arbeitsplan!H252<>\"\",Arbeitsplan!H252-Arbeitsplan!G252+1,\"\"),\"\")","v":""},{"$f":"IF(Arbeitsplan!C252<>\"\",IF(Arbeitsplan!H252<>\"\",Arbeitsplan!H252-Arbeitsplan!G252+1,\"\"),\"\")","v":""}]
[{"$f":"IF(C249<>\"\",Arbeitsplan!F253,\"\")","v":""},{"$f":"IF(Arbeitsplan!F253<>\"\",Arbeitsplan!G253,\"\")","v":""},null,{"$f":"IF(Arbeitsplan!B253<>\"\",IF(Arbeitsplan!H253<>\"\",Arbeitsplan!H253-Arbeitsplan!G253+1,\"\"),\"\")","v":""},{"$f":"IF(Arbeitsplan!C253<>\"\",IF(Arbeitsplan!H253<>\"\",Arbeitsplan!H253-Arbeitsplan!G253+1,\"\"),\"\")","v":""}]
[{"$f":"IF(C250<>\"\",Arbeitsplan!#REF!,\"\")","v":""},{"$f":"IF(Arbeitsplan!#REF!<>\"\",Arbeitsplan!#REF!,\"\")","v":{"$error":"#REF!"}},null,null,{"$f":"IF(Arbeitsplan!#REF!<>\"\",IF(Arbeitsplan!#REF!<>\"\",Arbeitsplan!#REF!-Arbeitsplan!#REF!+1,\"\"),\"\")","v":{"$error":"#REF!"}}]
[{"$f":"IF(C251<>\"\",Arbeitsplan!F254,\"\")","v":{"$error":"#N/A"}},{"$f":"IF(Arbeitsplan!F254<>\"\",Arbeitsplan!G254,\"\")","v":{"$error":"#N/A"}},{"$f":"IF(Arbeitsplan!A254<>\"\",IF(Arbeitsplan!H254<>\"\",Arbeitsplan!H254-Arbeitsplan!G254+1,\"\"),\"\")","v":{"$error":"#N/A"}},{"$f":"IF(Arbeitsplan!B254<>\"\",IF(Arbeitsplan!H254<>\"\",Arbeitsplan!H254-Arbeitsplan!G254+1,\"\"),\"\")","v":""},{"$f":"IF(Arbeitsplan!C254<>\"\",IF(Arbeitsplan!H254<>\"\",Arbeitsplan!H254-Arbeitsplan!G254+1,\"\"),\"\")","v":""}]
[{"$f":"IF(C252<>\"\",Arbeitsplan!F255,\"\")","v":""},{"$f":"IF(Arbeitsplan!F255<>\"\",Arbeitsplan!G255,\"\")","v":"00:00:00"},null,{"$f":"IF(Arbeitsplan!B255<>\"\",IF(Arbeitsplan!H255<>\"\",Arbeitsplan!H255-Arbeitsplan!G255+1,\"\"),\"\")","v":{"$error":"#N/A"}},{"$f":"IF(Arbeitsplan!C255<>\"\",IF(Arbeitsplan!H255<>\"\",Arbeitsplan!H255-Arbeitsplan!G255+1,\"\"),\"\")","v":""}]
[{"$f":"IF(C253<>\"\",Arbeitsplan!F256,\"\")","v":""},{"$f":"IF(Arbeitsplan!F256<>\"\",Arbeitsplan!G256,\"\")","v":"00:00:00"},null,null,{"$f":"IF(Arbeitsplan!C256<>\"\",IF(Arbeitsplan!H256<>\"\",Arbeitsplan!H256-Arbeitsplan!G256+1,\"\"),\"\")","v":{"$error":"#N/A"}}]
[{"$f":"IF(C254<>\"\",Arbeitsplan!F257,\"\")","v":""},{"$f":"IF(Arbeitsplan!F257<>\"\",Arbeitsplan!G257,\"\")","v":"00:00:00"},null,null,{"$f":"IF(Arbeitsplan!C257<>\"\",IF(Arbeitsplan!H257<>\"\",Arbeitsplan!H257-Arbeitsplan!G257+1,\"\"),\"\")","v":{"$error":"#N/A"}}]
[{"$f":"IF(C255<>\"\",Arbeitsplan!F258,\"\")","v":""},{"$f":"IF(Arbeitsplan!F258<>\"\",Arbeitsplan!G258,\"\")","v":"00:00:00"},null,null,{"$f":"IF(Arbeitsplan!C258<>\"\",IF(Arbeitsplan!H258<>\"\",Arbeitsplan!H258-Arbeitsplan!G258+1,\"\"),\"\")","v":{"$error":"#N/A"}}]
[{"$f":"IF(C256<>\"\",Arbeitsplan!F259,\"\")","v":""},{"$f":"IF(Arbeitsplan!F259<>\"\",Arbeitsplan!G259,\"\")","v":""},{"$f":"IF(Arbeitsplan!A259<>\"\",IF(Arbeitsplan!H259<>\"\",Arbeitsplan!H259-Arbeitsplan!G259+1,\"\"),\"\")","v":""},{"$f":"IF(Arbeitsplan!B259<>\"\",IF(Arbeitsplan!H259<>\"\",Arbeitsplan!H259-Arbeitsplan!G259+1,\"\"),\"\")","v":""},{"$f":"IF(Arbeitsplan!C259<>\"\",IF(Arbeitsplan!H259<>\"\",Arbeitsplan!H259-Arbeitsplan!G259+1,\"\"),\"\")","v":""}]
[{"$f":"IF(C257<>\"\",Arbeitsplan!F260,\"\")","v":""},{"$f":"IF(Arbeitsplan!F260<>\"\",Arbeitsplan!G260,\"\")","v":{"$error":"#N/A"}},null,{"$f":"IF(Arbeitsplan!B260<>\"\",IF(Arbeitsplan!H260<>\"\",Arbeitsplan!H260-Arbeitsplan!G260+1,\"\"),\"\")","v":{"$error":"#N/A"}},{"$f":"IF(Arbeitsplan!C260<>\"\",IF(Arbeitsplan!H260<>\"\",Arbeitsplan!H260-Arbeitsplan!G260+1,\"\"),\"\")","v":""}]
[{"$f":"IF(C258<>\"\",Arbeitsplan!F261,\"\")","v":""},{"$f":"IF(Arbeitsplan!F261<>\"\",Arbeitsplan!G261,\"\")","v":{"$error":"#N/A"}},null,null,{"$f":"IF(Arbeitsplan!C261<>\"\",IF(Arbeitsplan!H261<>\"\",Arbeitsplan!H261-Arbeitsplan!G261+1,\"\"),\"\")","v":{"$error":"#N/A"}}]
[{"$f":"IF(C259<>\"\",Arbeitsplan!F262,\"\")","v":""},{"$f":"IF(Arbeitsplan!F262<>\"\",Arbeitsplan!G262,\"\")","v":{"$error":"#N/A"}},null,null,{"$f":"IF(Arbeitsplan!C262<>\"\",IF(Arbeitsplan!H262<>\"\",Arbeitsplan!H262-Arbeitsplan!G262+1,\"\"),\"\")","v":{"$error":"#N/A"}}]
[{"$f":"IF(C260<>\"\",Arbeitsplan!F263,\"\")","v":""},{"$f":"IF(Arbeitsplan!F263<>\"\",Arbeitsplan!G263,\"\")","v":{"$error":"#N/A"}},null,null,{"$f":"IF(Arbeitsplan!C263<>\"\",IF(Arbeitsplan!H263<>\"\",Arbeitsplan!H263-Arbeitsplan!G263+1,\"\"),\"\")","v":{"$error":"#N/A"}}]
[{"$f":"IF(C261<>\"\",Arbeitsplan!F264,\"\")","v":""},{"$f":"IF(Arbeitsplan!F264<>\"\",Arbeitsplan!G264,\"\")","v":""},{"$f":"IF(Arbeitsplan!A264<>\"\",IF(Arbeitsplan!H264<>\"\",Arbeitsplan!H264-Arbeitsplan!G264+1,\"\"),\"\")","v":""},{"$f":"IF(Arbeitsplan!B264<>\"\",IF(Arbeitsplan!H264<>\"\",Arbeitsplan!H264-Arbeitsplan!G264+1,\"\"),\"\")","v":""},{"$f":"IF(Arbeitsplan!C264<>\"\",IF(Arbeitsplan!H264<>\"\",Arbeitsplan!H264-Arbeitsplan!G264+1,\"\"),\"\")","v":""}]
[{"$f":"IF(C262<>\"\",Arbeitsplan!F265,\"\")","v":""},{"$f":"IF(Arbeitsplan!F265<>\"\",Arbeitsplan!G265,\"\")","v":{"$error":"#N/A"}},null,{"$f":"IF(Arbeitsplan!B265<>\"\",IF(Arbeitsplan!H265<>\"\",Arbeitsplan!H265-Arbeitsplan!G265+1,\"\"),\"\")","v":{"$error":"#N/A"}},{"$f":"IF(Arbeitsplan!C265<>\"\",IF(Arbeitsplan!H265<>\"\",Arbeitsplan!H265-Arbeitsplan!G265+1,\"\"),\"\")","v":""}]
[{"$f":"IF(C263<>\"\",Arbeitsplan!F266,\"\")","v":""},{"$f":"IF(Arbeitsplan!F266<>\"\",Arbeitsplan!G266,\"\")","v":{"$error":"#N/A"}},null,null,{"$f":"IF(Arbeitsplan!C266<>\"\",IF(Arbeitsplan!H266<>\"\",Arbeitsplan!H266-Arbeitsplan!G266+1,\"\"),\"\")","v":{"$error":"#N/A"}}]
[{"$f":"IF(C264<>\"\",Arbeitsplan!F267,\"\")","v":""},{"$f":"IF(Arbeitsplan!F267<>\"\",Arbeitsplan!G267,\"\")","v":{"$error":"#N/A"}},null,null,{"$f":"IF(Arbeitsplan!C267<>\"\",IF(Arbeitsplan!H267<>\"\",Arbeitsplan!H267-Arbeitsplan!G267+1,\"\"),\"\")","v":{"$error":"#N/A"}}]
[{"$f":"IF(C265<>\"\",Arbeitsplan!F268,\"\")","v":""},{"$f":"IF(Arbeitsplan!F268<>\"\",Arbeitsplan!G268,\"\")","v":{"$error":"#N/A"}},null,null,{"$f":"IF(Arbeitsplan!C268<>\"\",IF(Arbeitsplan!H268<>\"\",Arbeitsplan!H268-Arbeitsplan!G268+1,\"\"),\"\")","v":{"$error":"#N/A"}}]
[{"$f":"IF(C266<>\"\",Arbeitsplan!F269,\"\")","v":""},{"$f":"IF(Arbeitsplan!F269<>\"\",Arbeitsplan!G269,\"\")","v":""},{"$f":"IF(Arbeitsplan!A269<>\"\",IF(Arbeitsplan!H269<>\"\",Arbeitsplan!H269-Arbeitsplan!G269+1,\"\"),\"\")","v":""},{"$f":"IF(Arbeitsplan!B269<>\"\",IF(Arbeitsplan!H269<>\"\",Arbeitsplan!H269-Arbeitsplan!G269+1,\"\"),\"\")","v":""},{"$f":"IF(Arbeitsplan!C269<>\"\",IF(Arbeitsplan!H269<>\"\",Arbeitsplan!H269-Arbeitsplan!G269+1,\"\"),\"\")","v":""}]
[{"$f":"IF(C267<>\"\",Arbeitsplan!F270,\"\")","v":""},{"$f":"IF(Arbeitsplan!F270<>\"\",Arbeitsplan!G270,\"\")","v":{"$error":"#N/A"}},null,{"$f":"IF(Arbeitsplan!B270<>\"\",IF(Arbeitsplan!H270<>\"\",Arbeitsplan!H270-Arbeitsplan!G270+1,\"\"),\"\")","v":{"$error":"#N/A"}},{"$f":"IF(Arbeitsplan!C270<>\"\",IF(Arbeitsplan!H270<>\"\",Arbeitsplan!H270-Arbeitsplan!G270+1,\"\"),\"\")","v":""}]
[{"$f":"IF(C268<>\"\",Arbeitsplan!F271,\"\")","v":""},{"$f":"IF(Arbeitsplan!F271<>\"\",Arbeitsplan!G271,\"\")","v":{"$error":"#N/A"}},null,null,{"$f":"IF(Arbeitsplan!C271<>\"\",IF(Arbeitsplan!H271<>\"\",Arbeitsplan!H271-Arbeitsplan!G271+1,\"\"),\"\")","v":{"$error":"#N/A"}}]
[{"$f":"IF(C269<>\"\",Arbeitsplan!F272,\"\")","v":""},{"$f":"IF(Arbeitsplan!F272<>\"\",Arbeitsplan!G272,\"\")","v":{"$error":"#N/A"}},null,null,{"$f":"IF(Arbeitsplan!C272<>\"\",IF(Arbeitsplan!H272<>\"\",Arbeitsplan!H272-Arbeitsplan!G272+1,\"\"),\"\")","v":{"$error":"#N/A"}}]
[{"$f":"IF(C270<>\"\",Arbeitsplan!F273,\"\")","v":""},{"$f":"IF(Arbeitsplan!F273<>\"\",Arbeitsplan!G273,\"\")","v":{"$error":"#N/A"}},null,null,{"$f":"IF(Arbeitsplan!C273<>\"\",IF(Arbeitsplan!H273<>\"\",Arbeitsplan!H273-Arbeitsplan!G273+1,\"\"),\"\")","v":{"$error":"#N/A"}}]
[{"$f":"IF(C271<>\"\",Arbeitsplan!F274,\"\")","v":""},{"$f":"IF(Arbeitsplan!F274<>\"\",Arbeitsplan!G274,\"\")","v":""},null,{"$f":"IF(Arbeitsplan!B274<>\"\",IF(Arbeitsplan!H274<>\"\",Arbeitsplan!H274-Arbeitsplan!G274+1,\"\"),\"\")","v":""},{"$f":"IF(Arbeitsplan!C274<>\"\",IF(Arbeitsplan!H274<>\"\",Arbeitsplan!H274-Arbeitsplan!G274+1,\"\"),\"\")","v":""}]
[{"$f":"IF(C272<>\"\",Arbeitsplan!F275,\"\")","v":""},{"$f":"IF(Arbeitsplan!F275<>\"\",Arbeitsplan!G275,\"\")","v":""},null,null,{"$f":"IF(Arbeitsplan!C275<>\"\",IF(Arbeitsplan!H275<>\"\",Arbeitsplan!H275-Arbeitsplan!G275+1,\"\"),\"\")","v":""}]
[{"$f":"IF(C273<>\"\",Arbeitsplan!F276,\"\")","v":{"$error":"#N/A"}},{"$f":"IF(Arbeitsplan!F276<>\"\",Arbeitsplan!G276,\"\")","v":{"$error":"#N/A"}},{"$f":"IF(Arbeitsplan!A276<>\"\",IF(Arbeitsplan!H276<>\"\",Arbeitsplan!H276-Arbeitsplan!G276+1,\"\"),\"\")","v":{"$error":"#N/A"}},{"$f":"IF(Arbeitsplan!B276<>\"\",IF(Arbeitsplan!H276<>\"\",Arbeitsplan!H276-Arbeitsplan!G276+1,\"\"),\"\")","v":""},{"$f":"IF(Arbeitsplan!C276<>\"\",IF(Arbeitsplan!H276<>\"\",Arbeitsplan!H276-Arbeitsplan!G276+1,\"\"),\"\")","v":""}]
[{"$f":"IF(C274<>\"\",Arbeitsplan!F277,\"\")","v":""},{"$f":"IF(Arbeitsplan!F277<>\"\",Arbeitsplan!G277,\"\")","v":"00:00:00"},null,{"$f":"IF(Arbeitsplan!B277<>\"\",IF(Arbeitsplan!H277<>\"\",Arbeitsplan!H277-Arbeitsplan!G277+1,\"\"),\"\")","v":{"$error":"#N/A"}},{"$f":"IF(Arbeitsplan!C277<>\"\",IF(Arbeitsplan!H277<>\"\",Arbeitsplan!H277-Arbeitsplan!G277+1,\"\"),\"\")","v":""}]
[{"$f":"IF(C275<>\"\",Arbeitsplan!F278,\"\")","v":""},{"$f":"IF(Arbeitsplan!F278<>\"\",Arbeitsplan!G278,\"\")","v":"00:00:00"},null,null,{"$f":"IF(Arbeitsplan!C278<>\"\",IF(Arbeitsplan!H278<>\"\",Arbeitsplan!H278-Arbeitsplan!G278+1,\"\"),\"\")","v":{"$error":"#N/A"}}]
[{"$f":"IF(C276<>\"\",Arbeitsplan!F279,\"\")","v":""},{"$f":"IF(Arbeitsplan!F279<>\"\",Arbeitsplan!G279,\"\")","v":"00:00:00"},null,null,{"$f":"IF(Arbeitsplan!C279<>\"\",IF(Arbeitsplan!H279<>\"\",Arbeitsplan!H279-Arbeitsplan!G279+1,\"\"),\"\")","v":{"$error":"#N/A"}}]
[{"$f":"IF(C277<>\"\",Arbeitsplan!F280,\"\")","v":""},{"$f":"IF(Arbeitsplan!F280<>\"\",Arbeitsplan!G280,\"\")","v":"00:00:00"},null,null,{"$f":"IF(Arbeitsplan!C280<>\"\",IF(Arbeitsplan!H280<>\"\",Arbeitsplan!H280-Arbeitsplan!G280+1,\"\"),\"\")","v":{"$error":"#N/A"}}]
[{"$f":"IF(C278<>\"\",Arbeitsplan!F281,\"\")","v":""},{"$f":"IF(Arbeitsplan!F281<>\"\",Arbeitsplan!G281,\"\")","v":""},{"$f":"IF(Arbeitsplan!A281<>\"\",IF(Arbeitsplan!H281<>\"\",Arbeitsplan!H281-Arbeitsplan!G281+1,\"\"),\"\")","v":""},{"$f":"IF(Arbeitsplan!B281<>\"\",IF(Arbeitsplan!H281<>\"\",Arbeitsplan!H281-Arbeitsplan!G281+1,\"\"),\"\")","v":""},{"$f":"IF(Arbeitsplan!C281<>\"\",IF(Arbeitsplan!H281<>\"\",Arbeitsplan!H281-Arbeitsplan!G281+1,\"\"),\"\")","v":""}]
[{"$f":"IF(C279<>\"\",Arbeitsplan!F282,\"\")","v":""},{"$f":"IF(Arbeitsplan!F282<>\"\",Arbeitsplan!G282,\"\")","v":{"$error":"#N/A"}},null,{"$f":"IF(Arbeitsplan!B282<>\"\",IF(Arbeitsplan!H282<>\"\",Arbeitsplan!H282-Arbeitsplan!G282+1,\"\"),\"\")","v":{"$error":"#N/A"}},{"$f":"IF(Arbeitsplan!C282<>\"\",IF(Arbeitsplan!H282<>\"\",Arbeitsplan!H282-Arbeitsplan!G282+1,\"\"),\"\")","v":""}]
[{"$f":"IF(C280<>\"\",Arbeitsplan!F283,\"\")","v":""},{"$f":"IF(Arbeitsplan!F283<>\"\",Arbeitsplan!G283,\"\")","v":{"$error":"#N/A"}},null,null,{"$f":"IF(Arbeitsplan!C283<>\"\",IF(Arbeitsplan!H283<>\"\",Arbeitsplan!H283-Arbeitsplan!G283+1,\"\"),\"\")","v":{"$error":"#N/A"}}]
[{"$f":"IF(C281<>\"\",Arbeitsplan!F284,\"\")","v":""},{"$f":"IF(Arbeitsplan!F284<>\"\",Arbeitsplan!G284,\"\")","v":{"$error":"#N/A"}},null,null,{"$f":"IF(Arbeitsplan!C284<>\"\",IF(Arbeitsplan!H284<>\"\",Arbeitsplan!H284-Arbeitsplan!G284+1,\"\"),\"\")","v":{"$error":"#N/A"}}]
[{"$f":"IF(C282<>\"\",Arbeitsplan!F285,\"\")","v":""},{"$f":"IF(Arbeitsplan!F285<>\"\",Arbeitsplan!G285,\"\")","v":{"$error":"#N/A"}},null,null,{"$f":"IF(Arbeitsplan!C285<>\"\",IF(Arbeitsplan!H285<>\"\",Arbeitsplan!H285-Arbeitsplan!G285+1,\"\"),\"\")","v":{"$error":"#N/A"}}]
[{"$f":"IF(C283<>\"\",Arbeitsplan!F286,\"\")","v":""},{"$f":"IF(Arbeitsplan!F286<>\"\",Arbeitsplan!G286,\"\")","v":""},{"$f":"IF(Arbeitsplan!A286<>\"\",IF(Arbeitsplan!H286<>\"\",Arbeitsplan!H286-Arbeitsplan!G286+1,\"\"),\"\")","v":""},{"$f":"IF(Arbeitsplan!B286<>\"\",IF(Arbeitsplan!H286<>\"\",Arbeitsplan!H286-Arbeitsplan!G286+1,\"\"),\"\")","v":""},{"$f":"IF(Arbeitsplan!C286<>\"\",IF(Arbeitsplan!H286<>\"\",Arbeitsplan!H286-Arbeitsplan!G286+1,\"\"),\"\")","v":""}]
[{"$f":"IF(C284<>\"\",Arbeitsplan!F287,\"\")","v":""},{"$f":"IF(Arbeitsplan!F287<>\"\",Arbeitsplan!G287,\"\")","v":{"$error":"#N/A"}},null,{"$f":"IF(Arbeitsplan!B287<>\"\",IF(Arbeitsplan!H287<>\"\",Arbeitsplan!H287-Arbeitsplan!G287+1,\"\"),\"\")","v":{"$error":"#N/A"}},{"$f":"IF(Arbeitsplan!C287<>\"\",IF(Arbeitsplan!H287<>\"\",Arbeitsplan!H287-Arbeitsplan!G287+1,\"\"),\"\")","v":""}]
[{"$f":"IF(C285<>\"\",Arbeitsplan!F288,\"\")","v":""},{"$f":"IF(Arbeitsplan!F288<>\"\",Arbeitsplan!G288,\"\")","v":{"$error":"#N/A"}},null,null,{"$f":"IF(Arbeitsplan!C288<>\"\",IF(Arbeitsplan!H288<>\"\",Arbeitsplan!H288-Arbeitsplan!G288+1,\"\"),\"\")","v":{"$error":"#N/A"}}]
[{"$f":"IF(C286<>\"\",Arbeitsplan!F289,\"\")","v":""},{"$f":"IF(Arbeitsplan!F289<>\"\",Arbeitsplan!G289,\"\")","v":{"$error":"#N/A"}},null,null,{"$f":"IF(Arbeitsplan!C289<>\"\",IF(Arbeitsplan!H289<>\"\",Arbeitsplan!H289-Arbeitsplan!G289+1,\"\"),\"\")","v":{"$error":"#N/A"}}]
[{"$f":"IF(C287<>\"\",Arbeitsplan!F290,\"\")","v":""},{"$f":"IF(Arbeitsplan!F290<>\"\",Arbeitsplan!G290,\"\")","v":{"$error":"#N/A"}},null,null,{"$f":"IF(Arbeitsplan!C290<>\"\",IF(Arbeitsplan!H290<>\"\",Arbeitsplan!H290-Arbeitsplan!G290+1,\"\"),\"\")","v":{"$error":"#N/A"}}]
[{"$f":"IF(C288<>\"\",Arbeitsplan!F291,\"\")","v":""},{"$f":"IF(Arbeitsplan!F291<>\"\",Arbeitsplan!G291,\"\")","v":""},{"$f":"IF(Arbeitsplan!A291<>\"\",IF(Arbeitsplan!H291<>\"\",Arbeitsplan!H291-Arbeitsplan!G291+1,\"\"),\"\")","v":""},{"$f":"IF(Arbeitsplan!B291<>\"\",IF(Arbeitsplan!H291<>\"\",Arbeitsplan!H291-Arbeitsplan!G291+1,\"\"),\"\")","v":""},{"$f":"IF(Arbeitsplan!C291<>\"\",IF(Arbeitsplan!H291<>\"\",Arbeitsplan!H291-Arbeitsplan!G291+1,\"\"),\"\")","v":""}]
[{"$f":"IF(C289<>\"\",Arbeitsplan!F292,\"\")","v":""},{"$f":"IF(Arbeitsplan!F292<>\"\",Arbeitsplan!G292,\"\")","v":{"$error":"#N/A"}},null,{"$f":"IF(Arbeitsplan!B292<>\"\",IF(Arbeitsplan!H292<>\"\",Arbeitsplan!H292-Arbeitsplan!G292+1,\"\"),\"\")","v":{"$error":"#N/A"}},{"$f":"IF(Arbeitsplan!C292<>\"\",IF(Arbeitsplan!H292<>\"\",Arbeitsplan!H292-Arbeitsplan!G292+1,\"\"),\"\")","v":""}]
[{"$f":"IF(C290<>\"\",Arbeitsplan!F293,\"\")","v":""},{"$f":"IF(Arbeitsplan!F293<>\"\",Arbeitsplan!G293,\"\")","v":{"$error":"#N/A"}},null,null,{"$f":"IF(Arbeitsplan!C293<>\"\",IF(Arbeitsplan!H293<>\"\",Arbeitsplan!H293-Arbeitsplan!G293+1,\"\"),\"\")","v":{"$error":"#N/A"}}]
[{"$f":"IF(C291<>\"\",Arbeitsplan!F294,\"\")","v":""},{"$f":"IF(Arbeitsplan!F294<>\"\",Arbeitsplan!G294,\"\")","v":{"$error":"#N/A"}},null,null,{"$f":"IF(Arbeitsplan!C294<>\"\",IF(Arbeitsplan!H294<>\"\",Arbeitsplan!H294-Arbeitsplan!G294+1,\"\"),\"\")","v":{"$error":"#N/A"}}]
[{"$f":"IF(C292<>\"\",Arbeitsplan!F295,\"\")","v":""},{"$f":"IF(Arbeitsplan!F295<>\"\",Arbeitsplan!G295,\"\")","v":{"$error":"#N/A"}},null,null,{"$f":"IF(Arbeitsplan!C295<>\"\",IF(Arbeitsplan!H295<>\"\",Arbeitsplan!H295-Arbeitsplan!G295+1,\"\"),\"\")","v":{"$error":"#N/A"}}]
[{"$f":"IF(C293<>\"\",Arbeitsplan!F296,\"\")","v":""},{"$f":"IF(Arbeitsplan!F296<>\"\",Arbeitsplan!G296,\"\")","v":""},null,{"$f":"IF(Arbeitsplan!B296<>\"\",IF(Arbeitsplan!H296<>\"\",Arbeitsplan!H296-Arbeitsplan!G296+1,\"\"),\"\")","v":""},{"$f":"IF(Arbeitsplan!C296<>\"\",IF(Arbeitsplan!H296<>\"\",Arbeitsplan!H296-Arbeitsplan!G296+1,\"\"),\"\")","v":""}]
[{"$f":"IF(C294<>\"\",Arbeitsplan!F297,\"\")","v":""},{"$f":"IF(Arbeitsplan!F297<>\"\",Arbeitsplan!G297,\"\")","v":""},null,null,{"$f":"IF(Arbeitsplan!C297<>\"\",IF(Arbeitsplan!H297<>\"\",Arbeitsplan!H297-Arbeitsplan!G297+1,\"\"),\"\")","v":""}]
[{"$f":"IF(C295<>\"\",Arbeitsplan!#REF!,\"\")","v":""},{"$f":"IF(Arbeitsplan!#REF!<>\"\",Arbeitsplan!#REF!,\"\")","v":{"$error":"#REF!"}},null,null,{"$f":"IF(Arbeitsplan!#REF!<>\"\",IF(Arbeitsplan!#REF!<>\"\",Arbeitsplan!#REF!-Arbeitsplan!#REF!+1,\"\"),\"\")","v":{"$error":"#REF!"}}]
[{"$f":"IF(C296<>\"\",Arbeitsplan!F298,\"\")","v":{"$error":"#N/A"}},{"$f":"IF(Arbeitsplan!F298<>\"\",Arbeitsplan!G298,\"\")","v":{"$error":"#N/A"}},{"$f":"IF(Arbeitsplan!A298<>\"\",IF(Arbeitsplan!H298<>\"\",Arbeitsplan!H298-Arbeitsplan!G298+1,\"\"),\"\")","v":{"$error":"#N/A"}},{"$f":"IF(Arbeitsplan!B298<>\"\",IF(Arbeitsplan!H298<>\"\",Arbeitsplan!H298-Arbeitsplan!G298+1,\"\"),\"\")","v":""},{"$f":"IF(Arbeitsplan!C298<>\"\",IF(Arbeitsplan!H298<>\"\",Arbeitsplan!H298-Arbeitsplan!G298+1,\"\"),\"\")","v":""}]
[{"$f":"IF(C297<>\"\",Arbeitsplan!F299,\"\")","v":""},{"$f":"IF(Arbeitsplan!F299<>\"\",Arbeitsplan!G299,\"\")","v":"00:00:00"},null,{"$f":"IF(Arbeitsplan!B299<>\"\",IF(Arbeitsplan!H299<>\"\",Arbeitsplan!H299-Arbeitsplan!G299+1,\"\"),\"\")","v":{"$error":"#N/A"}},{"$f":"IF(Arbeitsplan!C299<>\"\",IF(Arbeitsplan!H299<>\"\",Arbeitsplan!H299-Arbeitsplan!G299+1,\"\"),\"\")","v":""}]
[{"$f":"IF(C298<>\"\",Arbeitsplan!F300,\"\")","v":""},{"$f":"IF(Arbeitsplan!F300<>\"\",Arbeitsplan!G300,\"\")","v":"00:00:00"},null,null,{"$f":"IF(Arbeitsplan!C300<>\"\",IF(Arbeitsplan!H300<>\"\",Arbeitsplan!H300-Arbeitsplan!G300+1,\"\"),\"\")","v":{"$error":"#N/A"}}]
[{"$f":"IF(C299<>\"\",Arbeitsplan!F301,\"\")","v":""},{"$f":"IF(Arbeitsplan!F301<>\"\",Arbeitsplan!G301,\"\")","v":"00:00:00"},null,null,{"$f":"IF(Arbeitsplan!C301<>\"\",IF(Arbeitsplan!H301<>\"\",Arbeitsplan!H301-Arbeitsplan!G301+1,\"\"),\"\")","v":{"$error":"#N/A"}}]
[{"$f":"IF(C300<>\"\",Arbeitsplan!F302,\"\")","v":""},{"$f":"IF(Arbeitsplan!F302<>\"\",Arbeitsplan!G302,\"\")","v":"00:00:00"},null,null,{"$f":"IF(Arbeitsplan!C302<>\"\",IF(Arbeitsplan!H302<>\"\",Arbeitsplan!H302-Arbeitsplan!G302+1,\"\"),\"\")","v":{"$error":"#N/A"}}]
[{"$f":"IF(C301<>\"\",Arbeitsplan!F303,\"\")","v":""},{"$f":"IF(Arbeitsplan!F303<>\"\",Arbeitsplan!G303,\"\")","v":""},{"$f":"IF(Arbeitsplan!A303<>\"\",IF(Arbeitsplan!H303<>\"\",Arbeitsplan!H303-Arbeitsplan!G303+1,\"\"),\"\")","v":""},{"$f":"IF(Arbeitsplan!B303<>\"\",IF(Arbeitsplan!H303<>\"\",Arbeitsplan!H303-Arbeitsplan!G303+1,\"\"),\"\")","v":""},{"$f":"IF(Arbeitsplan!C303<>\"\",IF(Arbeitsplan!H303<>\"\",Arbeitsplan!H303-Arbeitsplan!G303+1,\"\"),\"\")","v":""}]
[{"$f":"IF(C302<>\"\",Arbeitsplan!F304,\"\")","v":""},{"$f":"IF(Arbeitsplan!F304<>\"\",Arbeitsplan!G304,\"\")","v":{"$error":"#N/A"}},null,{"$f":"IF(Arbeitsplan!B304<>\"\",IF(Arbeitsplan!H304<>\"\",Arbeitsplan!H304-Arbeitsplan!G304+1,\"\"),\"\")","v":{"$error":"#N/A"}},{"$f":"IF(Arbeitsplan!C304<>\"\",IF(Arbeitsplan!H304<>\"\",Arbeitsplan!H304-Arbeitsplan!G304+1,\"\"),\"\")","v":""}]
[{"$f":"IF(C303<>\"\",Arbeitsplan!F305,\"\")","v":""},{"$f":"IF(Arbeitsplan!F305<>\"\",Arbeitsplan!G305,\"\")","v":{"$error":"#N/A"}},null,null,{"$f":"IF(Arbeitsplan!C305<>\"\",IF(Arbeitsplan!H305<>\"\",Arbeitsplan!H305-Arbeitsplan!G305+1,\"\"),\"\")","v":{"$error":"#N/A"}}]
[{"$f":"IF(C304<>\"\",Arbeitsplan!F306,\"\")","v":""},{"$f":"IF(Arbeitsplan!F306<>\"\",Arbeitsplan!G306,\"\")","v":{"$error":"#N/A"}},null,null,{"$f":"IF(Arbeitsplan!C306<>\"\",IF(Arbeitsplan!H306<>\"\",Arbeitsplan!H306-Arbeitsplan!G306+1,\"\"),\"\")","v":{"$error":"#N/A"}}]
[{"$f":"IF(C305<>\"\",Arbeitsplan!F307,\"\")","v":""},{"$f":"IF(Arbeitsplan!F307<>\"\",Arbeitsplan!G307,\"\")","v":{"$error":"#N/A"}},null,null,{"$f":"IF(Arbeitsplan!C307<>\"\",IF(Arbeitsplan!H307<>\"\",Arbeitsplan!H307-Arbeitsplan!G307+1,\"\"),\"\")","v":{"$error":"#N/A"}}]
[{"$f":"IF(C306<>\"\",Arbeitsplan!F308,\"\")","v":""},{"$f":"IF(Arbeitsplan!F308<>\"\",Arbeitsplan!G308,\"\")","v":""},{"$f":"IF(Arbeitsplan!A308<>\"\",IF(Arbeitsplan!H308<>\"\",Arbeitsplan!H308-Arbeitsplan!G308+1,\"\"),\"\")","v":""},{"$f":"IF(Arbeitsplan!B308<>\"\",IF(Arbeitsplan!H308<>\"\",Arbeitsplan!H308-Arbeitsplan!G308+1,\"\"),\"\")","v":""},{"$f":"IF(Arbeitsplan!C308<>\"\",IF(Arbeitsplan!H308<>\"\",Arbeitsplan!H308-Arbeitsplan!G308+1,\"\"),\"\")","v":""}]
[{"$f":"IF(C307<>\"\",Arbeitsplan!F309,\"\")","v":""},{"$f":"IF(Arbeitsplan!F309<>\"\",Arbeitsplan!G309,\"\")","v":{"$error":"#N/A"}},null,{"$f":"IF(Arbeitsplan!B309<>\"\",IF(Arbeitsplan!H309<>\"\",Arbeitsplan!H309-Arbeitsplan!G309+1,\"\"),\"\")","v":{"$error":"#N/A"}},{"$f":"IF(Arbeitsplan!C309<>\"\",IF(Arbeitsplan!H309<>\"\",Arbeitsplan!H309-Arbeitsplan!G309+1,\"\"),\"\")","v":""}]
[{"$f":"IF(C308<>\"\",Arbeitsplan!F310,\"\")","v":""},{"$f":"IF(Arbeitsplan!F310<>\"\",Arbeitsplan!G310,\"\")","v":{"$error":"#N/A"}},null,null,{"$f":"IF(Arbeitsplan!C310<>\"\",IF(Arbeitsplan!H310<>\"\",Arbeitsplan!H310-Arbeitsplan!G310+1,\"\"),\"\")","v":{"$error":"#N/A"}}]
[{"$f":"IF(C309<>\"\",Arbeitsplan!F311,\"\")","v":""},{"$f":"IF(Arbeitsplan!F311<>\"\",Arbeitsplan!G311,\"\")","v":{"$error":"#N/A"}},null,null,{"$f":"IF(Arbeitsplan!C311<>\"\",IF(Arbeitsplan!H311<>\"\",Arbeitsplan!H311-Arbeitsplan!G311+1,\"\"),\"\")","v":{"$error":"#N/A"}}]
[{"$f":"IF(C310<>\"\",Arbeitsplan!F312,\"\")","v":""},{"$f":"IF(Arbeitsplan!F312<>\"\",Arbeitsplan!G312,\"\")","v":{"$error":"#N/A"}},null,null,{"$f":"IF(Arbeitsplan!C312<>\"\",IF(Arbeitsplan!H312<>\"\",Arbeitsplan!H312-Arbeitsplan!G312+1,\"\"),\"\")","v":{"$error":"#N/A"}}]
[{"$f":"IF(C311<>\"\",Arbeitsplan!F313,\"\")","v":""},{"$f":"IF(Arbeitsplan!F313<>\"\",Arbeitsplan!G313,\"\")","v":""},{"$f":"IF(Arbeitsplan!A313<>\"\",IF(Arbeitsplan!H313<>\"\",Arbeitsplan!H313-Arbeitsplan!G313+1,\"\"),\"\")","v":""},{"$f":"IF(Arbeitsplan!B313<>\"\",IF(Arbeitsplan!H313<>\"\",Arbeitsplan!H313-Arbeitsplan!G313+1,\"\"),\"\")","v":""},{"$f":"IF(Arbeitsplan!C313<>\"\",IF(Arbeitsplan!H313<>\"\",Arbeitsplan!H313-Arbeitsplan!G313+1,\"\"),\"\")","v":""}]
[{"$f":"IF(C312<>\"\",Arbeitsplan!F314,\"\")","v":""},{"$f":"IF(Arbeitsplan!F314<>\"\",Arbeitsplan!G314,\"\")","v":{"$error":"#N/A"}},null,{"$f":"IF(Arbeitsplan!B314<>\"\",IF(Arbeitsplan!H314<>\"\",Arbeitsplan!H314-Arbeitsplan!G314+1,\"\"),\"\")","v":{"$error":"#N/A"}},{"$f":"IF(Arbeitsplan!C314<>\"\",IF(Arbeitsplan!H314<>\"\",Arbeitsplan!H314-Arbeitsplan!G314+1,\"\"),\"\")","v":""}]
[{"$f":"IF(C313<>\"\",Arbeitsplan!F315,\"\")","v":""},{"$f":"IF(Arbeitsplan!F315<>\"\",Arbeitsplan!G315,\"\")","v":{"$error":"#N/A"}},null,null,{"$f":"IF(Arbeitsplan!C315<>\"\",IF(Arbeitsplan!H315<>\"\",Arbeitsplan!H315-Arbeitsplan!G315+1,\"\"),\"\")","v":{"$error":"#N/A"}}]
[{"$f":"IF(C314<>\"\",Arbeitsplan!F316,\"\")","v":""},{"$f":"IF(Arbeitsplan!F316<>\"\",Arbeitsplan!G316,\"\")","v":{"$error":"#N/A"}},null,null,{"$f":"IF(Arbeitsplan!C316<>\"\",IF(Arbeitsplan!H316<>\"\",Arbeitsplan!H316-Arbeitsplan!G316+1,\"\"),\"\")","v":{"$error":"#N/A"}}]
[{"$f":"IF(C315<>\"\",Arbeitsplan!F317,\"\")","v":""},{"$f":"IF(Arbeitsplan!F317<>\"\",Arbeitsplan!G317,\"\")","v":{"$error":"#N/A"}},null,null,{"$f":"IF(Arbeitsplan!C317<>\"\",IF(Arbeitsplan!H317<>\"\",Arbeitsplan!H317-Arbeitsplan!G317+1,\"\"),\"\")","v":{"$error":"#N/A"}}]
[{"$f":"IF(C316<>\"\",Arbeitsplan!F318,\"\")","v":""},{"$f":"IF(Arbeitsplan!F318<>\"\",Arbeitsplan!G318,\"\")","v":""},null,null,{"$f":"IF(Arbeitsplan!C318<>\"\",IF(Arbeitsplan!H318<>\"\",Arbeitsplan!H318-Arbeitsplan!G318+1,\"\"),\"\")","v":""}]
[{"$f":"IF(C317<>\"\",Arbeitsplan!F319,\"\")","v":""},{"$f":"IF(Arbeitsplan!F319<>\"\",Arbeitsplan!G319,\"\")","v":""},null,null,{"$f":"IF(Arbeitsplan!C319<>\"\",IF(Arbeitsplan!H319<>\"\",Arbeitsplan!H319-Arbeitsplan!G319+1,\"\"),\"\")","v":""}]
[{"$f":"IF(C318<>\"\",Arbeitsplan!F320,\"\")","v":{"$error":"#N/A"}},{"$f":"IF(Arbeitsplan!F320<>\"\",Arbeitsplan!G320,\"\")","v":{"$error":"#N/A"}},{"$f":"IF(Arbeitsplan!A320<>\"\",IF(Arbeitsplan!H320<>\"\",Arbeitsplan!H320-Arbeitsplan!G320+1,\"\"),\"\")","v":{"$error":"#N/A"}},{"$f":"IF(Arbeitsplan!B320<>\"\",IF(Arbeitsplan!H320<>\"\",Arbeitsplan!H320-Arbeitsplan!G320+1,\"\"),\"\")","v":""},{"$f":"IF(Arbeitsplan!C320<>\"\",IF(Arbeitsplan!H320<>\"\",Arbeitsplan!H320-Arbeitsplan!G320+1,\"\"),\"\")","v":""}]
[{"$f":"IF(C319<>\"\",Arbeitsplan!F321,\"\")","v":""},{"$f":"IF(Arbeitsplan!F321<>\"\",Arbeitsplan!G321,\"\")","v":"00:00:00"},null,{"$f":"IF(Arbeitsplan!B321<>\"\",IF(Arbeitsplan!H321<>\"\",Arbeitsplan!H321-Arbeitsplan!G321+1,\"\"),\"\")","v":{"$error":"#N/A"}},{"$f":"IF(Arbeitsplan!C321<>\"\",IF(Arbeitsplan!H321<>\"\",Arbeitsplan!H321-Arbeitsplan!G321+1,\"\"),\"\")","v":""}]
[{"$f":"IF(C320<>\"\",Arbeitsplan!F322,\"\")","v":""},{"$f":"IF(Arbeitsplan!F322<>\"\",Arbeitsplan!G322,\"\")","v":"00:00:00"},null,null,{"$f":"IF(Arbeitsplan!C322<>\"\",IF(Arbeitsplan!H322<>\"\",Arbeitsplan!H322-Arbeitsplan!G322+1,\"\"),\"\")","v":{"$error":"#N/A"}}]
[{"$f":"IF(C321<>\"\",Arbeitsplan!F323,\"\")","v":""},{"$f":"IF(Arbeitsplan!F323<>\"\",Arbeitsplan!G323,\"\")","v":"00:00:00"},null,null,{"$f":"IF(Arbeitsplan!C323<>\"\",IF(Arbeitsplan!H323<>\"\",Arbeitsplan!H323-Arbeitsplan!G323+1,\"\"),\"\")","v":{"$error":"#N/A"}}]
[{"$f":"IF(C322<>\"\",Arbeitsplan!F324,\"\")","v":""},{"$f":"IF(Arbeitsplan!F324<>\"\",Arbeitsplan!G324,\"\")","v":"00:00:00"},null,null,{"$f":"IF(Arbeitsplan!C324<>\"\",IF(Arbeitsplan!H324<>\"\",Arbeitsplan!H324-Arbeitsplan!G324+1,\"\"),\"\")","v":{"$error":"#N/A"}}]
[{"$f":"IF(C323<>\"\",Arbeitsplan!F325,\"\")","v":""},{"$f":"IF(Arbeitsplan!F325<>\"\",Arbeitsplan!G325,\"\")","v":""},{"$f":"IF(Arbeitsplan!A325<>\"\",IF(Arbeitsplan!H325<>\"\",Arbeitsplan!H325-Arbeitsplan!G325+1,\"\"),\"\")","v":""},{"$f":"IF(Arbeitsplan!B325<>\"\",IF(Arbeitsplan!H325<>\"\",Arbeitsplan!H325-Arbeitsplan!G325+1,\"\"),\"\")","v":""},{"$f":"IF(Arbeitsplan!C325<>\"\",IF(Arbeitsplan!H325<>\"\",Arbeitsplan!H325-Arbeitsplan!G325+1,\"\"),\"\")","v":""}]
[{"$f":"IF(C324<>\"\",Arbeitsplan!F326,\"\")","v":""},{"$f":"IF(Arbeitsplan!F326<>\"\",Arbeitsplan!G326,\"\")","v":{"$error":"#N/A"}},null,{"$f":"IF(Arbeitsplan!B326<>\"\",IF(Arbeitsplan!H326<>\"\",Arbeitsplan!H326-Arbeitsplan!G326+1,\"\"),\"\")","v":{"$error":"#N/A"}},{"$f":"IF(Arbeitsplan!C326<>\"\",IF(Arbeitsplan!H326<>\"\",Arbeitsplan!H326-Arbeitsplan!G326+1,\"\"),\"\")","v":""}]
[{"$f":"IF(C325<>\"\",Arbeitsplan!F327,\"\")","v":""},{"$f":"IF(Arbeitsplan!F327<>\"\",Arbeitsplan!G327,\"\")","v":{"$error":"#N/A"}},null,null,{"$f":"IF(Arbeitsplan!C327<>\"\",IF(Arbeitsplan!H327<>\"\",Arbeitsplan!H327-Arbeitsplan!G327+1,\"\"),\"\")","v":{"$error":"#N/A"}}]
[{"$f":"IF(C326<>\"\",Arbeitsplan!F328,\"\")","v":""},{"$f":"IF(Arbeitsplan!F328<>\"\",Arbeitsplan!G328,\"\")","v":{"$error":"#N/A"}},null,null,{"$f":"IF(Arbeitsplan!C328<>\"\",IF(Arbeitsplan!H328<>\"\",Arbeitsplan!H328-Arbeitsplan!G328+1,\"\"),\"\")","v":{"$error":"#N/A"}}]
[{"$f":"IF(C327<>\"\",Arbeitsplan!F329,\"\")","v":""},{"$f":"IF(Arbeitsplan!F329<>\"\",Arbeitsplan!G329,\"\")","v":{"$error":"#N/A"}},null,null,{"$f":"IF(Arbeitsplan!C329<>\"\",IF(Arbeitsplan!H329<>\"\",Arbeitsplan!H329-Arbeitsplan!G329+1,\"\"),\"\")","v":{"$error":"#N/A"}}]
[{"$f":"IF(C328<>\"\",Arbeitsplan!F330,\"\")","v":""},{"$f":"IF(Arbeitsplan!F330<>\"\",Arbeitsplan!G330,\"\")","v":""},{"$f":"IF(Arbeitsplan!A330<>\"\",IF(Arbeitsplan!H330<>\"\",Arbeitsplan!H330-Arbeitsplan!G330+1,\"\"),\"\")","v":""},{"$f":"IF(Arbeitsplan!B330<>\"\",IF(Arbeitsplan!H330<>\"\",Arbeitsplan!H330-Arbeitsplan!G330+1,\"\"),\"\")","v":""},{"$f":"IF(Arbeitsplan!C330<>\"\",IF(Arbeitsplan!H330<>\"\",Arbeitsplan!H330-Arbeitsplan!G330+1,\"\"),\"\")","v":""}]
[{"$f":"IF(C329<>\"\",Arbeitsplan!F331,\"\")","v":""},{"$f":"IF(Arbeitsplan!F331<>\"\",Arbeitsplan!G331,\"\")","v":{"$error":"#N/A"}},null,{"$f":"IF(Arbeitsplan!B331<>\"\",IF(Arbeitsplan!H331<>\"\",Arbeitsplan!H331-Arbeitsplan!G331+1,\"\"),\"\")","v":{"$error":"#N/A"}},{"$f":"IF(Arbeitsplan!C331<>\"\",IF(Arbeitsplan!H331<>\"\",Arbeitsplan!H331-Arbeitsplan!G331+1,\"\"),\"\")","v":""}]
[{"$f":"IF(C330<>\"\",Arbeitsplan!F332,\"\")","v":""},{"$f":"IF(Arbeitsplan!F332<>\"\",Arbeitsplan!G332,\"\")","v":{"$error":"#N/A"}},null,null,{"$f":"IF(Arbeitsplan!C332<>\"\",IF(Arbeitsplan!H332<>\"\",Arbeitsplan!H332-Arbeitsplan!G332+1,\"\"),\"\")","v":{"$error":"#N/A"}}]
[{"$f":"IF(C331<>\"\",Arbeitsplan!F333,\"\")","v":""},{"$f":"IF(Arbeitsplan!F333<>\"\",Arbeitsplan!G333,\"\")","v":{"$error":"#N/A"}},null,null,{"$f":"IF(Arbeitsplan!C333<>\"\",IF(Arbeitsplan!H333<>\"\",Arbeitsplan!H333-Arbeitsplan!G333+1,\"\"),\"\")","v":{"$error":"#N/A"}}]
[{"$f":"IF(C332<>\"\",Arbeitsplan!F334,\"\")","v":""},{"$f":"IF(Arbeitsplan!F334<>\"\",Arbeitsplan!G334,\"\")","v":{"$error":"#N/A"}},null,null,{"$f":"IF(Arbeitsplan!C334<>\"\",IF(Arbeitsplan!H334<>\"\",Arbeitsplan!H334-Arbeitsplan!G334+1,\"\"),\"\")","v":{"$error":"#N/A"}}]
[{"$f":"IF(C333<>\"\",Arbeitsplan!F335,\"\")","v":""},{"$f":"IF(Arbeitsplan!F335<>\"\",Arbeitsplan!G335,\"\")","v":""},{"$f":"IF(Arbeitsplan!A335<>\"\",IF(Arbeitsplan!H335<>\"\",Arbeitsplan!H335-Arbeitsplan!G335+1,\"\"),\"\")","v":""},{"$f":"IF(Arbeitsplan!B335<>\"\",IF(Arbeitsplan!H335<>\"\",Arbeitsplan!H335-Arbeitsplan!G335+1,\"\"),\"\")","v":""},{"$f":"IF(Arbeitsplan!C335<>\"\",IF(Arbeitsplan!H335<>\"\",Arbeitsplan!H335-Arbeitsplan!G335+1,\"\"),\"\")","v":""}]
[{"$f":"IF(C334<>\"\",Arbeitsplan!F336,\"\")","v":""},{"$f":"IF(Arbeitsplan!F336<>\"\",Arbeitsplan!G336,\"\")","v":{"$error":"#N/A"}},null,{"$f":"IF(Arbeitsplan!B336<>\"\",IF(Arbeitsplan!H336<>\"\",Arbeitsplan!H336-Arbeitsplan!G336+1,\"\"),\"\")","v":{"$error":"#N/A"}},{"$f":"IF(Arbeitsplan!C336<>\"\",IF(Arbeitsplan!H336<>\"\",Arbeitsplan!H336-Arbeitsplan!G336+1,\"\"),\"\")","v":""}]
[{"$f":"IF(C335<>\"\",Arbeitsplan!F337,\"\")","v":""},{"$f":"IF(Arbeitsplan!F337<>\"\",Arbeitsplan!G337,\"\")","v":{"$error":"#N/A"}},null,null,{"$f":"IF(Arbeitsplan!C337<>\"\",IF(Arbeitsplan!H337<>\"\",Arbeitsplan!H337-Arbeitsplan!G337+1,\"\"),\"\")","v":{"$error":"#N/A"}}]
[{"$f":"IF(C336<>\"\",Arbeitsplan!F338,\"\")","v":""},{"$f":"IF(Arbeitsplan!F338<>\"\",Arbeitsplan!G338,\"\")","v":{"$error":"#N/A"}},null,null,{"$f":"IF(Arbeitsplan!C338<>\"\",IF(Arbeitsplan!H338<>\"\",Arbeitsplan!H338-Arbeitsplan!G338+1,\"\"),\"\")","v":{"$error":"#N/A"}}]
[{"$f":"IF(C337<>\"\",Arbeitsplan!F339,\"\")","v":""},{"$f":"IF(Arbeitsplan!F339<>\"\",Arbeitsplan!G339,\"\")","v":{"$error":"#N/A"}},null,null,{"$f":"IF(Arbeitsplan!C339<>\"\",IF(Arbeitsplan!H339<>\"\",Arbeitsplan!H339-Arbeitsplan!G339+1,\"\"),\"\")","v":{"$error":"#N/A"}}]
[{"$f":"IF(C338<>\"\",Arbeitsplan!F340,\"\")","v":""},{"$f":"IF(Arbeitsplan!F340<>\"\",Arbeitsplan!G340,\"\")","v":""},null,null,{"$f":"IF(Arbeitsplan!C340<>\"\",IF(Arbeitsplan!H340<>\"\",Arbeitsplan!H340-Arbeitsplan!G340+1,\"\"),\"\")","v":""}]
[{"$f":"IF(C339<>\"\",Arbeitsplan!F341,\"\")","v":""},{"$f":"IF(Arbeitsplan!F341<>\"\",Arbeitsplan!G341,\"\")","v":""},null,null,{"$f":"IF(Arbeitsplan!C341<>\"\",IF(Arbeitsplan!H341<>\"\",Arbeitsplan!H341-Arbeitsplan!G341+1,\"\"),\"\")","v":""}]
[{"$f":"IF(C340<>\"\",Arbeitsplan!#REF!,\"\")","v":""},{"$f":"IF(Arbeitsplan!#REF!<>\"\",Arbeitsplan!#REF!,\"\")","v":{"$error":"#REF!"}},null,null,{"$f":"IF(Arbeitsplan!#REF!<>\"\",IF(Arbeitsplan!#REF!<>\"\",Arbeitsplan!#REF!-Arbeitsplan!#REF!+1,\"\"),\"\")","v":{"$error":"#REF!"}}]
[{"$f":"IF(C341<>\"\",Arbeitsplan!F342,\"\")","v":{"$error":"#N/A"}},{"$f":"IF(Arbeitsplan!F342<>\"\",Arbeitsplan!G342,\"\")","v":{"$error":"#N/A"}},{"$f":"IF(Arbeitsplan!A342<>\"\",IF(Arbeitsplan!H342<>\"\",Arbeitsplan!H342-Arbeitsplan!G342+1,\"\"),\"\")","v":{"$error":"#N/A"}},{"$f":"IF(Arbeitsplan!B342<>\"\",IF(Arbeitsplan!H342<>\"\",Arbeitsplan!H342-Arbeitsplan!G342+1,\"\"),\"\")","v":""},{"$f":"IF(Arbeitsplan!C342<>\"\",IF(Arbeitsplan!H342<>\"\",Arbeitsplan!H342-Arbeitsplan!G342+1,\"\"),\"\")","v":""}]
[{"$f":"IF(C342<>\"\",Arbeitsplan!F343,\"\")","v":""},{"$f":"IF(Arbeitsplan!F343<>\"\",Arbeitsplan!G343,\"\")","v":"00:00:00"},null,{"$f":"IF(Arbeitsplan!B343<>\"\",IF(Arbeitsplan!H343<>\"\",Arbeitsplan!H343-Arbeitsplan!G343+1,\"\"),\"\")","v":{"$error":"#N/A"}},{"$f":"IF(Arbeitsplan!C343<>\"\",IF(Arbeitsplan!H343<>\"\",Arbeitsplan!H343-Arbeitsplan!G343+1,\"\"),\"\")","v":""}]
[{"$f":"IF(C343<>\"\",Arbeitsplan!F344,\"\")","v":""},{"$f":"IF(Arbeitsplan!F344<>\"\",Arbeitsplan!G344,\"\")","v":"00:00:00"},null,null,{"$f":"IF(Arbeitsplan!C344<>\"\",IF(Arbeitsplan!H344<>\"\",Arbeitsplan!H344-Arbeitsplan!G344+1,\"\"),\"\")","v":{"$error":"#N/A"}}]
[{"$f":"IF(C344<>\"\",Arbeitsplan!F345,\"\")","v":""},{"$f":"IF(Arbeitsplan!F345<>\"\",Arbeitsplan!G345,\"\")","v":"00:00:00"},null,null,{"$f":"IF(Arbeitsplan!C345<>\"\",IF(Arbeitsplan!H345<>\"\",Arbeitsplan!H345-Arbeitsplan!G345+1,\"\"),\"\")","v":{"$error":"#N/A"}}]
[{"$f":"IF(C345<>\"\",Arbeitsplan!F346,\"\")","v":""},{"$f":"IF(Arbeitsplan!F346<>\"\",Arbeitsplan!G346,\"\")","v":"00:00:00"},null,null,{"$f":"IF(Arbeitsplan!C346<>\"\",IF(Arbeitsplan!H346<>\"\",Arbeitsplan!H346-Arbeitsplan!G346+1,\"\"),\"\")","v":{"$error":"#N/A"}}]
[{"$f":"IF(C346<>\"\",Arbeitsplan!F347,\"\")","v":""},{"$f":"IF(Arbeitsplan!F347<>\"\",Arbeitsplan!G347,\"\")","v":""},{"$f":"IF(Arbeitsplan!A347<>\"\",IF(Arbeitsplan!H347<>\"\",Arbeitsplan!H347-Arbeitsplan!G347+1,\"\"),\"\")","v":""},{"$f":"IF(Arbeitsplan!B347<>\"\",IF(Arbeitsplan!H347<>\"\",Arbeitsplan!H347-Arbeitsplan!G347+1,\"\"),\"\")","v":""},{"$f":"IF(Arbeitsplan!C347<>\"\",IF(Arbeitsplan!H347<>\"\",Arbeitsplan!H347-Arbeitsplan!G347+1,\"\"),\"\")","v":""}]
[{"$f":"IF(C347<>\"\",Arbeitsplan!F348,\"\")","v":""},{"$f":"IF(Arbeitsplan!F348<>\"\",Arbeitsplan!G348,\"\")","v":{"$error":"#N/A"}},null,{"$f":"IF(Arbeitsplan!B348<>\"\",IF(Arbeitsplan!H348<>\"\",Arbeitsplan!H348-Arbeitsplan!G348+1,\"\"),\"\")","v":{"$error":"#N/A"}},{"$f":"IF(Arbeitsplan!C348<>\"\",IF(Arbeitsplan!H348<>\"\",Arbeitsplan!H348-Arbeitsplan!G348+1,\"\"),\"\")","v":""}]
[{"$f":"IF(C348<>\"\",Arbeitsplan!F349,\"\")","v":""},{"$f":"IF(Arbeitsplan!F349<>\"\",Arbeitsplan!G349,\"\")","v":{"$error":"#N/A"}},null,null,{"$f":"IF(Arbeitsplan!C349<>\"\",IF(Arbeitsplan!H349<>\"\",Arbeitsplan!H349-Arbeitsplan!G349+1,\"\"),\"\")","v":{"$error":"#N/A"}}]
[{"$f":"IF(C349<>\"\",Arbeitsplan!F350,\"\")","v":""},{"$f":"IF(Arbeitsplan!F350<>\"\",Arbeitsplan!G350,\"\")","v":{"$error":"#N/A"}},null,null,{"$f":"IF(Arbeitsplan!C350<>\"\",IF(Arbeitsplan!H350<>\"\",Arbeitsplan!H350-Arbeitsplan!G350+1,\"\"),\"\")","v":{"$error":"#N/A"}}]
[{"$f":"IF(C350<>\"\",Arbeitsplan!F351,\"\")","v":""},{"$f":"IF(Arbeitsplan!F351<>\"\",Arbeitsplan!G351,\"\")","v":{"$error":"#N/A"}},null,null,{"$f":"IF(Arbeitsplan!C351<>\"\",IF(Arbeitsplan!H351<>\"\",Arbeitsplan!H351-Arbeitsplan!G351+1,\"\"),\"\")","v":{"$error":"#N/A"}}]
[{"$f":"IF(C351<>\"\",Arbeitsplan!F352,\"\")","v":""},{"$f":"IF(Arbeitsplan!F352<>\"\",Arbeitsplan!G352,\"\")","v":""},{"$f":"IF(Arbeitsplan!A352<>\"\",IF(Arbeitsplan!H352<>\"\",Arbeitsplan!H352-Arbeitsplan!G352+1,\"\"),\"\")","v":""},{"$f":"IF(Arbeitsplan!B352<>\"\",IF(Arbeitsplan!H352<>\"\",Arbeitsplan!H352-Arbeitsplan!G352+1,\"\"),\"\")","v":""},{"$f":"IF(Arbeitsplan!C352<>\"\",IF(Arbeitsplan!H352<>\"\",Arbeitsplan!H352-Arbeitsplan!G352+1,\"\"),\"\")","v":""}]
[{"$f":"IF(C352<>\"\",Arbeitsplan!F353,\"\")","v":""},{"$f":"IF(Arbeitsplan!F353<>\"\",Arbeitsplan!G353,\"\")","v":{"$error":"#N/A"}},null,{"$f":"IF(Arbeitsplan!B353<>\"\",IF(Arbeitsplan!H353<>\"\",Arbeitsplan!H353-Arbeitsplan!G353+1,\"\"),\"\")","v":{"$error":"#N/A"}},{"$f":"IF(Arbeitsplan!C353<>\"\",IF(Arbeitsplan!H353<>\"\",Arbeitsplan!H353-Arbeitsplan!G353+1,\"\"),\"\")","v":""}]
[{"$f":"IF(C353<>\"\",Arbeitsplan!F354,\"\")","v":""},{"$f":"IF(Arbeitsplan!F354<>\"\",Arbeitsplan!G354,\"\")","v":{"$error":"#N/A"}},null,null,{"$f":"IF(Arbeitsplan!C354<>\"\",IF(Arbeitsplan!H354<>\"\",Arbeitsplan!H354-Arbeitsplan!G354+1,\"\"),\"\")","v":{"$error":"#N/A"}}]
[{"$f":"IF(C354<>\"\",Arbeitsplan!F355,\"\")","v":""},{"$f":"IF(Arbeitsplan!F355<>\"\",Arbeitsplan!G355,\"\")","v":{"$error":"#N/A"}},null,null,{"$f":"IF(Arbeitsplan!C355<>\"\",IF(Arbeitsplan!H355<>\"\",Arbeitsplan!H355-Arbeitsplan!G355+1,\"\"),\"\")","v":{"$error":"#N/A"}}]
[{"$f":"IF(C355<>\"\",Arbeitsplan!F356,\"\")","v":""},{"$f":"IF(Arbeitsplan!F356<>\"\",Arbeitsplan!G356,\"\")","v":{"$error":"#N/A"}},null,null,{"$f":"IF(Arbeitsplan!C356<>\"\",IF(Arbeitsplan!H356<>\"\",Arbeitsplan!H356-Arbeitsplan!G356+1,\"\"),\"\")","v":{"$error":"#N/A"}}]
[{"$f":"IF(C356<>\"\",Arbeitsplan!F357,\"\")","v":""},{"$f":"IF(Arbeitsplan!F357<>\"\",Arbeitsplan!G357,\"\")","v":""},{"$f":"IF(Arbeitsplan!A357<>\"\",IF(Arbeitsplan!H357<>\"\",Arbeitsplan!H357-Arbeitsplan!G357+1,\"\"),\"\")","v":""},{"$f":"IF(Arbeitsplan!B357<>\"\",IF(Arbeitsplan!H357<>\"\",Arbeitsplan!H357-Arbeitsplan!G357+1,\"\"),\"\")","v":""},{"$f":"IF(Arbeitsplan!C357<>\"\",IF(Arbeitsplan!H357<>\"\",Arbeitsplan!H357-Arbeitsplan!G357+1,\"\"),\"\")","v":""}]
[{"$f":"IF(C357<>\"\",Arbeitsplan!F358,\"\")","v":""},{"$f":"IF(Arbeitsplan!F358<>\"\",Arbeitsplan!G358,\"\")","v":{"$error":"#N/A"}},null,{"$f":"IF(Arbeitsplan!B358<>\"\",IF(Arbeitsplan!H358<>\"\",Arbeitsplan!H358-Arbeitsplan!G358+1,\"\"),\"\")","v":{"$error":"#N/A"}},{"$f":"IF(Arbeitsplan!C358<>\"\",IF(Arbeitsplan!H358<>\"\",Arbeitsplan!H358-Arbeitsplan!G358+1,\"\"),\"\")","v":""}]
[{"$f":"IF(C358<>\"\",Arbeitsplan!F359,\"\")","v":""},{"$f":"IF(Arbeitsplan!F359<>\"\",Arbeitsplan!G359,\"\")","v":{"$error":"#N/A"}},null,null,{"$f":"IF(Arbeitsplan!C359<>\"\",IF(Arbeitsplan!H359<>\"\",Arbeitsplan!H359-Arbeitsplan!G359+1,\"\"),\"\")","v":{"$error":"#N/A"}}]
[{"$f":"IF(C359<>\"\",Arbeitsplan!F360,\"\")","v":""},{"$f":"IF(Arbeitsplan!F360<>\"\",Arbeitsplan!G360,\"\")","v":{"$error":"#N/A"}},null,null,{"$f":"IF(Arbeitsplan!C360<>\"\",IF(Arbeitsplan!H360<>\"\",Arbeitsplan!H360-Arbeitsplan!G360+1,\"\"),\"\")","v":{"$error":"#N/A"}}]
[{"$f":"IF(C360<>\"\",Arbeitsplan!F361,\"\")","v":""},{"$f":"IF(Arbeitsplan!F361<>\"\",Arbeitsplan!G361,\"\")","v":{"$error":"#N/A"}},null,null,{"$f":"IF(Arbeitsplan!C361<>\"\",IF(Arbeitsplan!H361<>\"\",Arbeitsplan!H361-Arbeitsplan!G361+1,\"\"),\"\")","v":{"$error":"#N/A"}}]
[{"$f":"IF(C361<>\"\",Arbeitsplan!F362,\"\")","v":""},{"$f":"IF(Arbeitsplan!F362<>\"\",Arbeitsplan!G362,\"\")","v":""}]
[{"$f":"IF(C362<>\"\",Arbeitsplan!F363,\"\")","v":""},{"$f":"IF(Arbeitsplan!F363<>\"\",Arbeitsplan!G363,\"\")","v":""}]
[{"$f":"IF(C363<>\"\",Arbeitsplan!F364,\"\")","v":{"$error":"#N/A"}},{"$f":"IF(Arbeitsplan!F364<>\"\",Arbeitsplan!G364,\"\")","v":{"$error":"#N/A"}},{"$f":"IF(Arbeitsplan!A364<>\"\",IF(Arbeitsplan!H364<>\"\",Arbeitsplan!H364-Arbeitsplan!G364+1,\"\"),\"\")","v":{"$error":"#N/A"}},{"$f":"IF(Arbeitsplan!B364<>\"\",IF(Arbeitsplan!H364<>\"\",Arbeitsplan!H364-Arbeitsplan!G364+1,\"\"),\"\")","v":""},{"$f":"IF(Arbeitsplan!C364<>\"\",IF(Arbeitsplan!H364<>\"\",Arbeitsplan!H364-Arbeitsplan!G364+1,\"\"),\"\")","v":""}]
[{"$f":"IF(C364<>\"\",Arbeitsplan!F365,\"\")","v":""},{"$f":"IF(Arbeitsplan!F365<>\"\",Arbeitsplan!G365,\"\")","v":"00:00:00"},null,{"$f":"IF(Arbeitsplan!B365<>\"\",IF(Arbeitsplan!H365<>\"\",Arbeitsplan!H365-Arbeitsplan!G365+1,\"\"),\"\")","v":{"$error":"#N/A"}},{"$f":"IF(Arbeitsplan!C365<>\"\",IF(Arbeitsplan!H365<>\"\",Arbeitsplan!H365-Arbeitsplan!G365+1,\"\"),\"\")","v":""}]
[{"$f":"IF(C365<>\"\",Arbeitsplan!F366,\"\")","v":""},{"$f":"IF(Arbeitsplan!F366<>\"\",Arbeitsplan!G366,\"\")","v":"00:00:00"},null,null,{"$f":"IF(Arbeitsplan!C366<>\"\",IF(Arbeitsplan!H366<>\"\",Arbeitsplan!H366-Arbeitsplan!G366+1,\"\"),\"\")","v":{"$error":"#N/A"}}]
[{"$f":"IF(C366<>\"\",Arbeitsplan!F367,\"\")","v":""},{"$f":"IF(Arbeitsplan!F367<>\"\",Arbeitsplan!G367,\"\")","v":"00:00:00"},null,null,{"$f":"IF(Arbeitsplan!C367<>\"\",IF(Arbeitsplan!H367<>\"\",Arbeitsplan!H367-Arbeitsplan!G367+1,\"\"),\"\")","v":{"$error":"#N/A"}}]
[{"$f":"IF(C367<>\"\",Arbeitsplan!F368,\"\")","v":""},{"$f":"IF(Arbeitsplan!F368<>\"\",Arbeitsplan!G368,\"\")","v":"00:00:00"},null,null,{"$f":"IF(Arbeitsplan!C368<>\"\",IF(Arbeitsplan!H368<>\"\",Arbeitsplan!H368-Arbeitsplan!G368+1,\"\"),\"\")","v":{"$error":"#N/A"}}]
[{"$f":"IF(C368<>\"\",Arbeitsplan!F369,\"\")","v":""},{"$f":"IF(Arbeitsplan!F369<>\"\",Arbeitsplan!G369,\"\")","v":""},{"$f":"IF(Arbeitsplan!A369<>\"\",IF(Arbeitsplan!H369<>\"\",Arbeitsplan!H369-Arbeitsplan!G369+1,\"\"),\"\")","v":""},{"$f":"IF(Arbeitsplan!B369<>\"\",IF(Arbeitsplan!H369<>\"\",Arbeitsplan!H369-Arbeitsplan!G369+1,\"\"),\"\")","v":""},{"$f":"IF(Arbeitsplan!C369<>\"\",IF(Arbeitsplan!H369<>\"\",Arbeitsplan!H369-Arbeitsplan!G369+1,\"\"),\"\")","v":""}]
[{"$f":"IF(C369<>\"\",Arbeitsplan!F370,\"\")","v":""},{"$f":"IF(Arbeitsplan!F370<>\"\",Arbeitsplan!G370,\"\")","v":{"$error":"#N/A"}},null,{"$f":"IF(Arbeitsplan!B370<>\"\",IF(Arbeitsplan!H370<>\"\",Arbeitsplan!H370-Arbeitsplan!G370+1,\"\"),\"\")","v":{"$error":"#N/A"}},{"$f":"IF(Arbeitsplan!C370<>\"\",IF(Arbeitsplan!H370<>\"\",Arbeitsplan!H370-Arbeitsplan!G370+1,\"\"),\"\")","v":""}]
[{"$f":"IF(C370<>\"\",Arbeitsplan!F371,\"\")","v":""},{"$f":"IF(Arbeitsplan!F371<>\"\",Arbeitsplan!G371,\"\")","v":{"$error":"#N/A"}},null,null,{"$f":"IF(Arbeitsplan!C371<>\"\",IF(Arbeitsplan!H371<>\"\",Arbeitsplan!H371-Arbeitsplan!G371+1,\"\"),\"\")","v":{"$error":"#N/A"}}]
[{"$f":"IF(C371<>\"\",Arbeitsplan!F372,\"\")","v":""},{"$f":"IF(Arbeitsplan!F372<>\"\",Arbeitsplan!G372,\"\")","v":{"$error":"#N/A"}},null,null,{"$f":"IF(Arbeitsplan!C372<>\"\",IF(Arbeitsplan!H372<>\"\",Arbeitsplan!H372-Arbeitsplan!G372+1,\"\"),\"\")","v":{"$error":"#N/A"}}]
[{"$f":"IF(C372<>\"\",Arbeitsplan!F373,\"\")","v":""},{"$f":"IF(Arbeitsplan!F373<>\"\",Arbeitsplan!G373,\"\")","v":{"$error":"#N/A"}},null,null,{"$f":"IF(Arbeitsplan!C373<>\"\",IF(Arbeitsplan!H373<>\"\",Arbeitsplan!H373-Arbeitsplan!G373+1,\"\"),\"\")","v":{"$error":"#N/A"}}]
[{"$f":"IF(C373<>\"\",Arbeitsplan!F374,\"\")","v":""},{"$f":"IF(Arbeitsplan!F374<>\"\",Arbeitsplan!G374,\"\")","v":""},{"$f":"IF(Arbeitsplan!A374<>\"\",IF(Arbeitsplan!H374<>\"\",Arbeitsplan!H374-Arbeitsplan!G374+1,\"\"),\"\")","v":""},{"$f":"IF(Arbeitsplan!B374<>\"\",IF(Arbeitsplan!H374<>\"\",Arbeitsplan!H374-Arbeitsplan!G374+1,\"\"),\"\")","v":""},{"$f":"IF(Arbeitsplan!C374<>\"\",IF(Arbeitsplan!H374<>\"\",Arbeitsplan!H374-Arbeitsplan!G374+1,\"\"),\"\")","v":""}]
[{"$f":"IF(C374<>\"\",Arbeitsplan!F375,\"\")","v":""},{"$f":"IF(Arbeitsplan!F375<>\"\",Arbeitsplan!G375,\"\")","v":{"$error":"#N/A"}},null,{"$f":"IF(Arbeitsplan!B375<>\"\",IF(Arbeitsplan!H375<>\"\",Arbeitsplan!H375-Arbeitsplan!G375+1,\"\"),\"\")","v":{"$error":"#N/A"}},{"$f":"IF(Arbeitsplan!C375<>\"\",IF(Arbeitsplan!H375<>\"\",Arbeitsplan!H375-Arbeitsplan!G375+1,\"\"),\"\")","v":""}]
[{"$f":"IF(C375<>\"\",Arbeitsplan!F376,\"\")","v":""},{"$f":"IF(Arbeitsplan!F376<>\"\",Arbeitsplan!G376,\"\")","v":{"$error":"#N/A"}},null,null,{"$f":"IF(Arbeitsplan!C376<>\"\",IF(Arbeitsplan!H376<>\"\",Arbeitsplan!H376-Arbeitsplan!G376+1,\"\"),\"\")","v":{"$error":"#N/A"}}]
[{"$f":"IF(C376<>\"\",Arbeitsplan!F377,\"\")","v":""},{"$f":"IF(Arbeitsplan!F377<>\"\",Arbeitsplan!G377,\"\")","v":{"$error":"#N/A"}},null,null,{"$f":"IF(Arbeitsplan!C377<>\"\",IF(Arbeitsplan!H377<>\"\",Arbeitsplan!H377-Arbeitsplan!G377+1,\"\"),\"\")","v":{"$error":"#N/A"}}]
[{"$f":"IF(C377<>\"\",Arbeitsplan!F378,\"\")","v":""},{"$f":"IF(Arbeitsplan!F378<>\"\",Arbeitsplan!G378,\"\")","v":{"$error":"#N/A"}},null,null,{"$f":"IF(Arbeitsplan!C378<>\"\",IF(Arbeitsplan!H378<>\"\",Arbeitsplan!H378-Arbeitsplan!G378+1,\"\"),\"\")","v":{"$error":"#N/A"}}]
[{"$f":"IF(C378<>\"\",Arbeitsplan!F379,\"\")","v":""},{"$f":"IF(Arbeitsplan!F379<>\"\",Arbeitsplan!G379,\"\")","v":""},{"$f":"IF(Arbeitsplan!A379<>\"\",IF(Arbeitsplan!H379<>\"\",Arbeitsplan!H379-Arbeitsplan!G379+1,\"\"),\"\")","v":""},{"$f":"IF(Arbeitsplan!B379<>\"\",IF(Arbeitsplan!H379<>\"\",Arbeitsplan!H379-Arbeitsplan!G379+1,\"\"),\"\")","v":""},{"$f":"IF(Arbeitsplan!C379<>\"\",IF(Arbeitsplan!H379<>\"\",Arbeitsplan!H379-Arbeitsplan!G379+1,\"\"),\"\")","v":""}]
[{"$f":"IF(C379<>\"\",Arbeitsplan!F380,\"\")","v":""},{"$f":"IF(Arbeitsplan!F380<>\"\",Arbeitsplan!G380,\"\")","v":{"$error":"#N/A"}},null,{"$f":"IF(Arbeitsplan!B380<>\"\",IF(Arbeitsplan!H380<>\"\",Arbeitsplan!H380-Arbeitsplan!G380+1,\"\"),\"\")","v":{"$error":"#N/A"}},{"$f":"IF(Arbeitsplan!C380<>\"\",IF(Arbeitsplan!H380<>\"\",Arbeitsplan!H380-Arbeitsplan!G380+1,\"\"),\"\")","v":""}]
[{"$f":"IF(C380<>\"\",Arbeitsplan!F381,\"\")","v":""},{"$f":"IF(Arbeitsplan!F381<>\"\",Arbeitsplan!G381,\"\")","v":{"$error":"#N/A"}},null,null,{"$f":"IF(Arbeitsplan!C381<>\"\",IF(Arbeitsplan!H381<>\"\",Arbeitsplan!H381-Arbeitsplan!G381+1,\"\"),\"\")","v":{"$error":"#N/A"}}]
[{"$f":"IF(C381<>\"\",Arbeitsplan!F382,\"\")","v":""},{"$f":"IF(Arbeitsplan!F382<>\"\",Arbeitsplan!G382,\"\")","v":{"$error":"#N/A"}},null,null,{"$f":"IF(Arbeitsplan!C382<>\"\",IF(Arbeitsplan!H382<>\"\",Arbeitsplan!H382-Arbeitsplan!G382+1,\"\"),\"\")","v":{"$error":"#N/A"}}]
[{"$f":"IF(C382<>\"\",Arbeitsplan!F383,\"\")","v":""},{"$f":"IF(Arbeitsplan!F383<>\"\",Arbeitsplan!G383,\"\")","v":{"$error":"#N/A"}},null,null,{"$f":"IF(Arbeitsplan!C383<>\"\",IF(Arbeitsplan!H383<>\"\",Arbeitsplan!H383-Arbeitsplan!G383+1,\"\"),\"\")","v":{"$error":"#N/A"}}]
[{"$f":"IF(C383<>\"\",Arbeitsplan!F384,\"\")","v":""},{"$f":"IF(Arbeitsplan!F384<>\"\",Arbeitsplan!G384,\"\")","v":""}]
[{"$f":"IF(C384<>\"\",Arbeitsplan!F385,\"\")","v":""},{"$f":"IF(Arbeitsplan!F385<>\"\",Arbeitsplan!G385,\"\")","v":""}]
[{"$f":"IF(C385<>\"\",Arbeitsplan!#REF!,\"\")","v":{"$error":"#REF!"}},{"$f":"IF(Arbeitsplan!#REF!<>\"\",Arbeitsplan!#REF!,\"\")","v":{"$error":"#REF!"}},{"$f":"IF(Arbeitsplan!#REF!<>\"\",IF(Arbeitsplan!#REF!<>\"\",Arbeitsplan!#REF!-Arbeitsplan!#REF!+1,\"\"),\"\")","v":{"$error":"#REF!"}},{"$f":"IF(Arbeitsplan!#REF!<>\"\",IF(Arbeitsplan!#REF!<>\"\",Arbeitsplan!#REF!-Arbeitsplan!#REF!+1,\"\"),\"\")","v":{"$error":"#REF!"}},{"$f":"IF(Arbeitsplan!#REF!<>\"\",IF(Arbeitsplan!#REF!<>\"\",Arbeitsplan!#REF!-Arbeitsplan!#REF!+1,\"\"),\"\")","v":{"$error":"#REF!"}}]
[{"$f":"IF(C386<>\"\",Arbeitsplan!F386,\"\")","v":{"$error":"#N/A"}},{"$f":"IF(Arbeitsplan!F386<>\"\",Arbeitsplan!G386,\"\")","v":{"$error":"#N/A"}},{"$f":"IF(Arbeitsplan!A386<>\"\",IF(Arbeitsplan!H386<>\"\",Arbeitsplan!H386-Arbeitsplan!G386+1,\"\"),\"\")","v":{"$error":"#N/A"}},{"$f":"IF(Arbeitsplan!B386<>\"\",IF(Arbeitsplan!H386<>\"\",Arbeitsplan!H386-Arbeitsplan!G386+1,\"\"),\"\")","v":""},{"$f":"IF(Arbeitsplan!C386<>\"\",IF(Arbeitsplan!H386<>\"\",Arbeitsplan!H386-Arbeitsplan!G386+1,\"\"),\"\")","v":""}]
[{"$f":"IF(C387<>\"\",Arbeitsplan!F387,\"\")","v":""},{"$f":"IF(Arbeitsplan!F387<>\"\",Arbeitsplan!G387,\"\")","v":"00:00:00"},null,{"$f":"IF(Arbeitsplan!B387<>\"\",IF(Arbeitsplan!H387<>\"\",Arbeitsplan!H387-Arbeitsplan!G387+1,\"\"),\"\")","v":{"$error":"#N/A"}},{"$f":"IF(Arbeitsplan!C387<>\"\",IF(Arbeitsplan!H387<>\"\",Arbeitsplan!H387-Arbeitsplan!G387+1,\"\"),\"\")","v":""}]
[{"$f":"IF(C388<>\"\",Arbeitsplan!F388,\"\")","v":""},{"$f":"IF(Arbeitsplan!F388<>\"\",Arbeitsplan!G388,\"\")","v":"00:00:00"},null,null,{"$f":"IF(Arbeitsplan!C388<>\"\",IF(Arbeitsplan!H388<>\"\",Arbeitsplan!H388-Arbeitsplan!G388+1,\"\"),\"\")","v":{"$error":"#N/A"}}]
[{"$f":"IF(C389<>\"\",Arbeitsplan!F389,\"\")","v":""},{"$f":"IF(Arbeitsplan!F389<>\"\",Arbeitsplan!G389,\"\")","v":"00:00:00"},null,null,{"$f":"IF(Arbeitsplan!C389<>\"\",IF(Arbeitsplan!H389<>\"\",Arbeitsplan!H389-Arbeitsplan!G389+1,\"\"),\"\")","v":{"$error":"#N/A"}}]
[{"$f":"IF(C390<>\"\",Arbeitsplan!F390,\"\")","v":""},{"$f":"IF(Arbeitsplan!F390<>\"\",Arbeitsplan!G390,\"\")","v":"00:00:00"},null,null,{"$f":"IF(Arbeitsplan!C390<>\"\",IF(Arbeitsplan!H390<>\"\",Arbeitsplan!H390-Arbeitsplan!G390+1,\"\"),\"\")","v":{"$error":"#N/A"}}]
[{"$f":"IF(C391<>\"\",Arbeitsplan!F391,\"\")","v":""},{"$f":"IF(Arbeitsplan!F391<>\"\",Arbeitsplan!G391,\"\")","v":""},{"$f":"IF(Arbeitsplan!A391<>\"\",IF(Arbeitsplan!H391<>\"\",Arbeitsplan!H391-Arbeitsplan!G391+1,\"\"),\"\")","v":""},{"$f":"IF(Arbeitsplan!B391<>\"\",IF(Arbeitsplan!H391<>\"\",Arbeitsplan!H391-Arbeitsplan!G391+1,\"\"),\"\")","v":""},{"$f":"IF(Arbeitsplan!C391<>\"\",IF(Arbeitsplan!H391<>\"\",Arbeitsplan!H391-Arbeitsplan!G391+1,\"\"),\"\")","v":""}]
[{"$f":"IF(C392<>\"\",Arbeitsplan!F392,\"\")","v":""},{"$f":"IF(Arbeitsplan!F392<>\"\",Arbeitsplan!G392,\"\")","v":{"$error":"#N/A"}},null,{"$f":"IF(Arbeitsplan!B392<>\"\",IF(Arbeitsplan!H392<>\"\",Arbeitsplan!H392-Arbeitsplan!G392+1,\"\"),\"\")","v":{"$error":"#N/A"}},{"$f":"IF(Arbeitsplan!C392<>\"\",IF(Arbeitsplan!H392<>\"\",Arbeitsplan!H392-Arbeitsplan!G392+1,\"\"),\"\")","v":""}]
[{"$f":"IF(C393<>\"\",Arbeitsplan!F393,\"\")","v":""},{"$f":"IF(Arbeitsplan!F393<>\"\",Arbeitsplan!G393,\"\")","v":{"$error":"#N/A"}},null,null,{"$f":"IF(Arbeitsplan!C393<>\"\",IF(Arbeitsplan!H393<>\"\",Arbeitsplan!H393-Arbeitsplan!G393+1,\"\"),\"\")","v":{"$error":"#N/A"}}]
[{"$f":"IF(C394<>\"\",Arbeitsplan!F394,\"\")","v":""},{"$f":"IF(Arbeitsplan!F394<>\"\",Arbeitsplan!G394,\"\")","v":{"$error":"#N/A"}},null,null,{"$f":"IF(Arbeitsplan!C394<>\"\",IF(Arbeitsplan!H394<>\"\",Arbeitsplan!H394-Arbeitsplan!G394+1,\"\"),\"\")","v":{"$error":"#N/A"}}]
[{"$f":"IF(C395<>\"\",Arbeitsplan!F395,\"\")","v":""},{"$f":"IF(Arbeitsplan!F395<>\"\",Arbeitsplan!G395,\"\")","v":{"$error":"#N/A"}},null,null,{"$f":"IF(Arbeitsplan!C395<>\"\",IF(Arbeitsplan!H395<>\"\",Arbeitsplan!H395-Arbeitsplan!G395+1,\"\"),\"\")","v":{"$error":"#N/A"}}]
[{"$f":"IF(C396<>\"\",Arbeitsplan!F396,\"\")","v":""},{"$f":"IF(Arbeitsplan!F396<>\"\",Arbeitsplan!G396,\"\")","v":""},{"$f":"IF(Arbeitsplan!A396<>\"\",IF(Arbeitsplan!H396<>\"\",Arbeitsplan!H396-Arbeitsplan!G396+1,\"\"),\"\")","v":""},{"$f":"IF(Arbeitsplan!B396<>\"\",IF(Arbeitsplan!H396<>\"\",Arbeitsplan!H396-Arbeitsplan!G396+1,\"\"),\"\")","v":""},{"$f":"IF(Arbeitsplan!C396<>\"\",IF(Arbeitsplan!H396<>\"\",Arbeitsplan!H396-Arbeitsplan!G396+1,\"\"),\"\")","v":""}]
[{"$f":"IF(C397<>\"\",Arbeitsplan!F397,\"\")","v":""},{"$f":"IF(Arbeitsplan!F397<>\"\",Arbeitsplan!G397,\"\")","v":{"$error":"#N/A"}},null,{"$f":"IF(Arbeitsplan!B397<>\"\",IF(Arbeitsplan!H397<>\"\",Arbeitsplan!H397-Arbeitsplan!G397+1,\"\"),\"\")","v":{"$error":"#N/A"}},{"$f":"IF(Arbeitsplan!C397<>\"\",IF(Arbeitsplan!H397<>\"\",Arbeitsplan!H397-Arbeitsplan!G397+1,\"\"),\"\")","v":""}]
[{"$f":"IF(C398<>\"\",Arbeitsplan!F398,\"\")","v":""},{"$f":"IF(Arbeitsplan!F398<>\"\",Arbeitsplan!G398,\"\")","v":{"$error":"#N/A"}},null,null,{"$f":"IF(Arbeitsplan!C398<>\"\",IF(Arbeitsplan!H398<>\"\",Arbeitsplan!H398-Arbeitsplan!G398+1,\"\"),\"\")","v":{"$error":"#N/A"}}]
[{"$f":"IF(C399<>\"\",Arbeitsplan!F399,\"\")","v":""},{"$f":"IF(Arbeitsplan!F399<>\"\",Arbeitsplan!G399,\"\")","v":{"$error":"#N/A"}},null,null,{"$f":"IF(Arbeitsplan!C399<>\"\",IF(Arbeitsplan!H399<>\"\",Arbeitsplan!H399-Arbeitsplan!G399+1,\"\"),\"\")","v":{"$error":"#N/A"}}]
[{"$f":"IF(C400<>\"\",Arbeitsplan!F400,\"\")","v":""},{"$f":"IF(Arbeitsplan!F400<>\"\",Arbeitsplan!G400,\"\")","v":{"$error":"#N/A"}},null,null,{"$f":"IF(Arbeitsplan!C400<>\"\",IF(Arbeitsplan!H400<>\"\",Arbeitsplan!H400-Arbeitsplan!G400+1,\"\"),\"\")","v":{"$error":"#N/A"}}]
[{"$f":"IF(C401<>\"\",Arbeitsplan!F401,\"\")","v":""},{"$f":"IF(Arbeitsplan!F401<>\"\",Arbeitsplan!G401,\"\")","v":""},{"$f":"IF(Arbeitsplan!A401<>\"\",IF(Arbeitsplan!H401<>\"\",Arbeitsplan!H401-Arbeitsplan!G401+1,\"\"),\"\")","v":""},{"$f":"IF(Arbeitsplan!B401<>\"\",IF(Arbeitsplan!H401<>\"\",Arbeitsplan!H401-Arbeitsplan!G401+1,\"\"),\"\")","v":""},{"$f":"IF(Arbeitsplan!C401<>\"\",IF(Arbeitsplan!H401<>\"\",Arbeitsplan!H401-Arbeitsplan!G401+1,\"\"),\"\")","v":""}]
[{"$f":"IF(C402<>\"\",Arbeitsplan!F402,\"\")","v":""},{"$f":"IF(Arbeitsplan!F402<>\"\",Arbeitsplan!G402,\"\")","v":{"$error":"#N/A"}},null,{"$f":"IF(Arbeitsplan!B402<>\"\",IF(Arbeitsplan!H402<>\"\",Arbeitsplan!H402-Arbeitsplan!G402+1,\"\"),\"\")","v":{"$error":"#N/A"}},{"$f":"IF(Arbeitsplan!C402<>\"\",IF(Arbeitsplan!H402<>\"\",Arbeitsplan!H402-Arbeitsplan!G402+1,\"\"),\"\")","v":""}]
[{"$f":"IF(C403<>\"\",Arbeitsplan!F403,\"\")","v":""},{"$f":"IF(Arbeitsplan!F403<>\"\",Arbeitsplan!G403,\"\")","v":{"$error":"#N/A"}},null,null,{"$f":"IF(Arbeitsplan!C403<>\"\",IF(Arbeitsplan!H403<>\"\",Arbeitsplan!H403-Arbeitsplan!G403+1,\"\"),\"\")","v":{"$error":"#N/A"}}]
[{"$f":"IF(C404<>\"\",Arbeitsplan!F404,\"\")","v":""},{"$f":"IF(Arbeitsplan!F404<>\"\",Arbeitsplan!G404,\"\")","v":{"$error":"#N/A"}},null,null,{"$f":"IF(Arbeitsplan!C404<>\"\",IF(Arbeitsplan!H404<>\"\",Arbeitsplan!H404-Arbeitsplan!G404+1,\"\"),\"\")","v":{"$error":"#N/A"}}]
[{"$f":"IF(C405<>\"\",Arbeitsplan!F405,\"\")","v":""},{"$f":"IF(Arbeitsplan!F405<>\"\",Arbeitsplan!G405,\"\")","v":{"$error":"#N/A"}},null,null,{"$f":"IF(Arbeitsplan!C405<>\"\",IF(Arbeitsplan!H405<>\"\",Arbeitsplan!H405-Arbeitsplan!G405+1,\"\"),\"\")","v":{"$error":"#N/A"}}]
[{"$f":"IF(C406<>\"\",Arbeitsplan!F406,\"\")","v":""},{"$f":"IF(Arbeitsplan!F406<>\"\",Arbeitsplan!G406,\"\")","v":""}]
[{"$f":"IF(C407<>\"\",Arbeitsplan!F407,\"\")","v":""},{"$f":"IF(Arbeitsplan!F407<>\"\",Arbeitsplan!G407,\"\")","v":""},{"$f":"IF(Arbeitsplan!A407<>\"\",IF(Arbeitsplan!H407<>\"\",Arbeitsplan!H407-Arbeitsplan!G407+1,\"\"),\"\")","v":""},{"$f":"IF(Arbeitsplan!B407<>\"\",IF(Arbeitsplan!H407<>\"\",Arbeitsplan!H407-Arbeitsplan!G407+1,\"\"),\"\")","v":""},{"$f":"IF(Arbeitsplan!C407<>\"\",IF(Arbeitsplan!H407<>\"\",Arbeitsplan!H407-Arbeitsplan!G407+1,\"\"),\"\")","v":""}]
[{"$f":"IF(C408<>\"\",Arbeitsplan!F408,\"\")","v":{"$error":"#N/A"}},{"$f":"IF(Arbeitsplan!F408<>\"\",Arbeitsplan!G408,\"\")","v":{"$error":"#N/A"}},{"$f":"IF(Arbeitsplan!A408<>\"\",IF(Arbeitsplan!H408<>\"\",Arbeitsplan!H408-Arbeitsplan!G408+1,\"\"),\"\")","v":{"$error":"#N/A"}},{"$f":"IF(Arbeitsplan!B408<>\"\",IF(Arbeitsplan!H408<>\"\",Arbeitsplan!H408-Arbeitsplan!G408+1,\"\"),\"\")","v":""},{"$f":"IF(Arbeitsplan!C408<>\"\",IF(Arbeitsplan!H408<>\"\",Arbeitsplan!H408-Arbeitsplan!G408+1,\"\"),\"\")","v":""}]
[{"$f":"IF(C409<>\"\",Arbeitsplan!F409,\"\")","v":""},{"$f":"IF(Arbeitsplan!F409<>\"\",Arbeitsplan!G409,\"\")","v":"00:00:00"},null,{"$f":"IF(Arbeitsplan!B409<>\"\",IF(Arbeitsplan!H409<>\"\",Arbeitsplan!H409-Arbeitsplan!G409+1,\"\"),\"\")","v":{"$error":"#N/A"}},{"$f":"IF(Arbeitsplan!C409<>\"\",IF(Arbeitsplan!H409<>\"\",Arbeitsplan!H409-Arbeitsplan!G409+1,\"\"),\"\")","v":""}]
[{"$f":"IF(C410<>\"\",Arbeitsplan!F410,\"\")","v":""},{"$f":"IF(Arbeitsplan!F410<>\"\",Arbeitsplan!G410,\"\")","v":"00:00:00"},null,null,{"$f":"IF(Arbeitsplan!C410<>\"\",IF(Arbeitsplan!H410<>\"\",Arbeitsplan!H410-Arbeitsplan!G410+1,\"\"),\"\")","v":{"$error":"#N/A"}}]
[{"$f":"IF(C411<>\"\",Arbeitsplan!F411,\"\")","v":""},{"$f":"IF(Arbeitsplan!F411<>\"\",Arbeitsplan!G411,\"\")","v":"00:00:00"},null,null,{"$f":"IF(Arbeitsplan!C411<>\"\",IF(Arbeitsplan!H411<>\"\",Arbeitsplan!H411-Arbeitsplan!G411+1,\"\"),\"\")","v":{"$error":"#N/A"}}]
[{"$f":"IF(C412<>\"\",Arbeitsplan!F412,\"\")","v":""},{"$f":"IF(Arbeitsplan!F412<>\"\",Arbeitsplan!G412,\"\")","v":"00:00:00"},null,null,{"$f":"IF(Arbeitsplan!C412<>\"\",IF(Arbeitsplan!H412<>\"\",Arbeitsplan!H412-Arbeitsplan!G412+1,\"\"),\"\")","v":{"$error":"#N/A"}}]
[{"$f":"IF(C413<>\"\",Arbeitsplan!F413,\"\")","v":""},{"$f":"IF(Arbeitsplan!F413<>\"\",Arbeitsplan!G413,\"\")","v":""},{"$f":"IF(Arbeitsplan!A413<>\"\",IF(Arbeitsplan!H413<>\"\",Arbeitsplan!H413-Arbeitsplan!G413+1,\"\"),\"\")","v":""},{"$f":"IF(Arbeitsplan!B413<>\"\",IF(Arbeitsplan!H413<>\"\",Arbeitsplan!H413-Arbeitsplan!G413+1,\"\"),\"\")","v":""},{"$f":"IF(Arbeitsplan!C413<>\"\",IF(Arbeitsplan!H413<>\"\",Arbeitsplan!H413-Arbeitsplan!G413+1,\"\"),\"\")","v":""}]
[{"$f":"IF(C414<>\"\",Arbeitsplan!F414,\"\")","v":""},{"$f":"IF(Arbeitsplan!F414<>\"\",Arbeitsplan!G414,\"\")","v":{"$error":"#N/A"}},null,{"$f":"IF(Arbeitsplan!B414<>\"\",IF(Arbeitsplan!H414<>\"\",Arbeitsplan!H414-Arbeitsplan!G414+1,\"\"),\"\")","v":{"$error":"#N/A"}},{"$f":"IF(Arbeitsplan!C414<>\"\",IF(Arbeitsplan!H414<>\"\",Arbeitsplan!H414-Arbeitsplan!G414+1,\"\"),\"\")","v":""}]
[{"$f":"IF(C415<>\"\",Arbeitsplan!F415,\"\")","v":""},{"$f":"IF(Arbeitsplan!F415<>\"\",Arbeitsplan!G415,\"\")","v":{"$error":"#N/A"}},null,null,{"$f":"IF(Arbeitsplan!C415<>\"\",IF(Arbeitsplan!H415<>\"\",Arbeitsplan!H415-Arbeitsplan!G415+1,\"\"),\"\")","v":{"$error":"#N/A"}}]
[{"$f":"IF(C416<>\"\",Arbeitsplan!F416,\"\")","v":""},{"$f":"IF(Arbeitsplan!F416<>\"\",Arbeitsplan!G416,\"\")","v":{"$error":"#N/A"}},null,null,{"$f":"IF(Arbeitsplan!C416<>\"\",IF(Arbeitsplan!H416<>\"\",Arbeitsplan!H416-Arbeitsplan!G416+1,\"\"),\"\")","v":{"$error":"#N/A"}}]
[{"$f":"IF(C417<>\"\",Arbeitsplan!F417,\"\")","v":""},{"$f":"IF(Arbeitsplan!F417<>\"\",Arbeitsplan!G417,\"\")","v":{"$error":"#N/A"}},null,null,{"$f":"IF(Arbeitsplan!C417<>\"\",IF(Arbeitsplan!H417<>\"\",Arbeitsplan!H417-Arbeitsplan!G417+1,\"\"),\"\")","v":{"$error":"#N/A"}}]
[{"$f":"IF(C418<>\"\",Arbeitsplan!F418,\"\")","v":""},{"$f":"IF(Arbeitsplan!F418<>\"\",Arbeitsplan!G418,\"\")","v":""},{"$f":"IF(Arbeitsplan!A418<>\"\",IF(Arbeitsplan!H418<>\"\",Arbeitsplan!H418-Arbeitsplan!G418+1,\"\"),\"\")","v":""},{"$f":"IF(Arbeitsplan!B418<>\"\",IF(Arbeitsplan!H418<>\"\",Arbeitsplan!H418-Arbeitsplan!G418+1,\"\"),\"\")","v":""},{"$f":"IF(Arbeitsplan!C418<>\"\",IF(Arbeitsplan!H418<>\"\",Arbeitsplan!H418-Arbeitsplan!G418+1,\"\"),\"\")","v":""}]
[{"$f":"IF(C419<>\"\",Arbeitsplan!F419,\"\")","v":""},{"$f":"IF(Arbeitsplan!F419<>\"\",Arbeitsplan!G419,\"\")","v":{"$error":"#N/A"}},null,{"$f":"IF(Arbeitsplan!B419<>\"\",IF(Arbeitsplan!H419<>\"\",Arbeitsplan!H419-Arbeitsplan!G419+1,\"\"),\"\")","v":{"$error":"#N/A"}},{"$f":"IF(Arbeitsplan!C419<>\"\",IF(Arbeitsplan!H419<>\"\",Arbeitsplan!H419-Arbeitsplan!G419+1,\"\"),\"\")","v":""}]
[{"$f":"IF(C420<>\"\",Arbeitsplan!F420,\"\")","v":""},{"$f":"IF(Arbeitsplan!F420<>\"\",Arbeitsplan!G420,\"\")","v":{"$error":"#N/A"}},null,null,{"$f":"IF(Arbeitsplan!C420<>\"\",IF(Arbeitsplan!H420<>\"\",Arbeitsplan!H420-Arbeitsplan!G420+1,\"\"),\"\")","v":{"$error":"#N/A"}}]
[{"$f":"IF(C421<>\"\",Arbeitsplan!F421,\"\")","v":""},{"$f":"IF(Arbeitsplan!F421<>\"\",Arbeitsplan!G421,\"\")","v":{"$error":"#N/A"}},null,null,{"$f":"IF(Arbeitsplan!C421<>\"\",IF(Arbeitsplan!H421<>\"\",Arbeitsplan!H421-Arbeitsplan!G421+1,\"\"),\"\")","v":{"$error":"#N/A"}}]
[{"$f":"IF(C422<>\"\",Arbeitsplan!F422,\"\")","v":""},{"$f":"IF(Arbeitsplan!F422<>\"\",Arbeitsplan!G422,\"\")","v":{"$error":"#N/A"}},null,null,{"$f":"IF(Arbeitsplan!C422<>\"\",IF(Arbeitsplan!H422<>\"\",Arbeitsplan!H422-Arbeitsplan!G422+1,\"\"),\"\")","v":{"$error":"#N/A"}}]
[{"$f":"IF(C423<>\"\",Arbeitsplan!F423,\"\")","v":""},{"$f":"IF(Arbeitsplan!F423<>\"\",Arbeitsplan!G423,\"\")","v":""},{"$f":"IF(Arbeitsplan!A423<>\"\",IF(Arbeitsplan!H423<>\"\",Arbeitsplan!H423-Arbeitsplan!G423+1,\"\"),\"\")","v":""},{"$f":"IF(Arbeitsplan!B423<>\"\",IF(Arbeitsplan!H423<>\"\",Arbeitsplan!H423-Arbeitsplan!G423+1,\"\"),\"\")","v":""},{"$f":"IF(Arbeitsplan!C423<>\"\",IF(Arbeitsplan!H423<>\"\",Arbeitsplan!H423-Arbeitsplan!G423+1,\"\"),\"\")","v":""}]
[{"$f":"IF(C424<>\"\",Arbeitsplan!F424,\"\")","v":""},{"$f":"IF(Arbeitsplan!F424<>\"\",Arbeitsplan!G424,\"\")","v":{"$error":"#N/A"}},null,{"$f":"IF(Arbeitsplan!B424<>\"\",IF(Arbeitsplan!H424<>\"\",Arbeitsplan!H424-Arbeitsplan!G424+1,\"\"),\"\")","v":{"$error":"#N/A"}},{"$f":"IF(Arbeitsplan!C424<>\"\",IF(Arbeitsplan!H424<>\"\",Arbeitsplan!H424-Arbeitsplan!G424+1,\"\"),\"\")","v":""}]
[{"$f":"IF(C425<>\"\",Arbeitsplan!F425,\"\")","v":""},{"$f":"IF(Arbeitsplan!F425<>\"\",Arbeitsplan!G425,\"\")","v":{"$error":"#N/A"}},null,null,{"$f":"IF(Arbeitsplan!C425<>\"\",IF(Arbeitsplan!H425<>\"\",Arbeitsplan!H425-Arbeitsplan!G425+1,\"\"),\"\")","v":{"$error":"#N/A"}}]
[{"$f":"IF(C426<>\"\",Arbeitsplan!F426,\"\")","v":""},{"$f":"IF(Arbeitsplan!F426<>\"\",Arbeitsplan!G426,\"\")","v":{"$error":"#N/A"}},null,null,{"$f":"IF(Arbeitsplan!C426<>\"\",IF(Arbeitsplan!H426<>\"\",Arbeitsplan!H426-Arbeitsplan!G426+1,\"\"),\"\")","v":{"$error":"#N/A"}}]
[{"$f":"IF(C427<>\"\",Arbeitsplan!F427,\"\")","v":""},{"$f":"IF(Arbeitsplan!F427<>\"\",Arbeitsplan!G427,\"\")","v":{"$error":"#N/A"}},null,null,{"$f":"IF(Arbeitsplan!C427<>\"\",IF(Arbeitsplan!H427<>\"\",Arbeitsplan!H427-Arbeitsplan!G427+1,\"\"),\"\")","v":{"$error":"#N/A"}}]
[{"$f":"IF(C428<>\"\",Arbeitsplan!F428,\"\")","v":""},{"$f":"IF(Arbeitsplan!F428<>\"\",Arbeitsplan!G428,\"\")","v":""}]
[{"$f":"IF(C429<>\"\",Arbeitsplan!F429,\"\")","v":""},{"$f":"IF(Arbeitsplan!F429<>\"\",Arbeitsplan!G429,\"\")","v":""},{"$f":"IF(Arbeitsplan!A429<>\"\",IF(Arbeitsplan!H429<>\"\",Arbeitsplan!H429-Arbeitsplan!G429+1,\"\"),\"\")","v":""},{"$f":"IF(Arbeitsplan!B429<>\"\",IF(Arbeitsplan!H429<>\"\",Arbeitsplan!H429-Arbeitsplan!G429+1,\"\"),\"\")","v":""},{"$f":"IF(Arbeitsplan!C429<>\"\",IF(Arbeitsplan!H429<>\"\",Arbeitsplan!H429-Arbeitsplan!G429+1,\"\"),\"\")","v":""}]
[{"$f":"IF(C430<>\"\",Arbeitsplan!F430,\"\")","v":{"$error":"#N/A"}},{"$f":"IF(Arbeitsplan!F430<>\"\",Arbeitsplan!G430,\"\")","v":{"$error":"#N/A"}},{"$f":"IF(Arbeitsplan!A430<>\"\",IF(Arbeitsplan!H430<>\"\",Arbeitsplan!H430-Arbeitsplan!G430+1,\"\"),\"\")","v":{"$error":"#N/A"}},{"$f":"IF(Arbeitsplan!B430<>\"\",IF(Arbeitsplan!H430<>\"\",Arbeitsplan!H430-Arbeitsplan!G430+1,\"\"),\"\")","v":""},{"$f":"IF(Arbeitsplan!C430<>\"\",IF(Arbeitsplan!H430<>\"\",Arbeitsplan!H430-Arbeitsplan!G430+1,\"\"),\"\")","v":""}]
[{"$f":"IF(C431<>\"\",Arbeitsplan!F431,\"\")","v":""},{"$f":"IF(Arbeitsplan!F431<>\"\",Arbeitsplan!G431,\"\")","v":"00:00:00"},null,{"$f":"IF(Arbeitsplan!B431<>\"\",IF(Arbeitsplan!H431<>\"\",Arbeitsplan!H431-Arbeitsplan!G431+1,\"\"),\"\")","v":{"$error":"#N/A"}},{"$f":"IF(Arbeitsplan!C431<>\"\",IF(Arbeitsplan!H431<>\"\",Arbeitsplan!H431-Arbeitsplan!G431+1,\"\"),\"\")","v":""}]
[{"$f":"IF(C432<>\"\",Arbeitsplan!F432,\"\")","v":""},{"$f":"IF(Arbeitsplan!F432<>\"\",Arbeitsplan!G432,\"\")","v":"00:00:00"},null,null,{"$f":"IF(Arbeitsplan!C432<>\"\",IF(Arbeitsplan!H432<>\"\",Arbeitsplan!H432-Arbeitsplan!G432+1,\"\"),\"\")","v":{"$error":"#N/A"}}]
[{"$f":"IF(C433<>\"\",Arbeitsplan!F433,\"\")","v":""},{"$f":"IF(Arbeitsplan!F433<>\"\",Arbeitsplan!G433,\"\")","v":"00:00:00"},null,null,{"$f":"IF(Arbeitsplan!C433<>\"\",IF(Arbeitsplan!H433<>\"\",Arbeitsplan!H433-Arbeitsplan!G433+1,\"\"),\"\")","v":{"$error":"#N/A"}}]
[{"$f":"IF(C434<>\"\",Arbeitsplan!F434,\"\")","v":""},{"$f":"IF(Arbeitsplan!F434<>\"\",Arbeitsplan!G434,\"\")","v":"00:00:00"},null,null,{"$f":"IF(Arbeitsplan!C434<>\"\",IF(Arbeitsplan!H434<>\"\",Arbeitsplan!H434-Arbeitsplan!G434+1,\"\"),\"\")","v":{"$error":"#N/A"}}]
[{"$f":"IF(C435<>\"\",Arbeitsplan!F435,\"\")","v":""},{"$f":"IF(Arbeitsplan!F435<>\"\",Arbeitsplan!G435,\"\")","v":""},{"$f":"IF(Arbeitsplan!A435<>\"\",IF(Arbeitsplan!H435<>\"\",Arbeitsplan!H435-Arbeitsplan!G435+1,\"\"),\"\")","v":""},{"$f":"IF(Arbeitsplan!B435<>\"\",IF(Arbeitsplan!H435<>\"\",Arbeitsplan!H435-Arbeitsplan!G435+1,\"\"),\"\")","v":""},{"$f":"IF(Arbeitsplan!C435<>\"\",IF(Arbeitsplan!H435<>\"\",Arbeitsplan!H435-Arbeitsplan!G435+1,\"\"),\"\")","v":""}]
[{"$f":"IF(C436<>\"\",Arbeitsplan!F436,\"\")","v":""},{"$f":"IF(Arbeitsplan!F436<>\"\",Arbeitsplan!G436,\"\")","v":{"$error":"#N/A"}},null,{"$f":"IF(Arbeitsplan!B436<>\"\",IF(Arbeitsplan!H436<>\"\",Arbeitsplan!H436-Arbeitsplan!G436+1,\"\"),\"\")","v":{"$error":"#N/A"}},{"$f":"IF(Arbeitsplan!C436<>\"\",IF(Arbeitsplan!H436<>\"\",Arbeitsplan!H436-Arbeitsplan!G436+1,\"\"),\"\")","v":""}]
[{"$f":"IF(C437<>\"\",Arbeitsplan!F437,\"\")","v":""},{"$f":"IF(Arbeitsplan!F437<>\"\",Arbeitsplan!G437,\"\")","v":{"$error":"#N/A"}},null,null,{"$f":"IF(Arbeitsplan!C437<>\"\",IF(Arbeitsplan!H437<>\"\",Arbeitsplan!H437-Arbeitsplan!G437+1,\"\"),\"\")","v":{"$error":"#N/A"}}]
[{"$f":"IF(C438<>\"\",Arbeitsplan!F438,\"\")","v":""},{"$f":"IF(Arbeitsplan!F438<>\"\",Arbeitsplan!G438,\"\")","v":{"$error":"#N/A"}},null,null,{"$f":"IF(Arbeitsplan!C438<>\"\",IF(Arbeitsplan!H438<>\"\",Arbeitsplan!H438-Arbeitsplan!G438+1,\"\"),\"\")","v":{"$error":"#N/A"}}]
[{"$f":"IF(C439<>\"\",Arbeitsplan!F439,\"\")","v":""},{"$f":"IF(Arbeitsplan!F439<>\"\",Arbeitsplan!G439,\"\")","v":{"$error":"#N/A"}},null,null,{"$f":"IF(Arbeitsplan!C439<>\"\",IF(Arbeitsplan!H439<>\"\",Arbeitsplan!H439-Arbeitsplan!G439+1,\"\"),\"\")","v":{"$error":"#N/A"}}]
[{"$f":"IF(C440<>\"\",Arbeitsplan!F440,\"\")","v":""},{"$f":"IF(Arbeitsplan!F440<>\"\",Arbeitsplan!G440,\"\")","v":""},{"$f":"IF(Arbeitsplan!A440<>\"\",IF(Arbeitsplan!H440<>\"\",Arbeitsplan!H440-Arbeitsplan!G440+1,\"\"),\"\")","v":""},{"$f":"IF(Arbeitsplan!B440<>\"\",IF(Arbeitsplan!H440<>\"\",Arbeitsplan!H440-Arbeitsplan!G440+1,\"\"),\"\")","v":""},{"$f":"IF(Arbeitsplan!C440<>\"\",IF(Arbeitsplan!H440<>\"\",Arbeitsplan!H440-Arbeitsplan!G440+1,\"\"),\"\")","v":""}]
[{"$f":"IF(C441<>\"\",Arbeitsplan!F441,\"\")","v":""},{"$f":"IF(Arbeitsplan!F441<>\"\",Arbeitsplan!G441,\"\")","v":{"$error":"#N/A"}},null,{"$f":"IF(Arbeitsplan!B441<>\"\",IF(Arbeitsplan!H441<>\"\",Arbeitsplan!H441-Arbeitsplan!G441+1,\"\"),\"\")","v":{"$error":"#N/A"}},{"$f":"IF(Arbeitsplan!C441<>\"\",IF(Arbeitsplan!H441<>\"\",Arbeitsplan!H441-Arbeitsplan!G441+1,\"\"),\"\")","v":""}]
[{"$f":"IF(C442<>\"\",Arbeitsplan!F442,\"\")","v":""},{"$f":"IF(Arbeitsplan!F442<>\"\",Arbeitsplan!G442,\"\")","v":{"$error":"#N/A"}},null,null,{"$f":"IF(Arbeitsplan!C442<>\"\",IF(Arbeitsplan!H442<>\"\",Arbeitsplan!H442-Arbeitsplan!G442+1,\"\"),\"\")","v":{"$error":"#N/A"}}]
[{"$f":"IF(C443<>\"\",Arbeitsplan!F443,\"\")","v":""},{"$f":"IF(Arbeitsplan!F443<>\"\",Arbeitsplan!G443,\"\")","v":{"$error":"#N/A"}},null,null,{"$f":"IF(Arbeitsplan!C443<>\"\",IF(Arbeitsplan!H443<>\"\",Arbeitsplan!H443-Arbeitsplan!G443+1,\"\"),\"\")","v":{"$error":"#N/A"}}]
[{"$f":"IF(C444<>\"\",Arbeitsplan!F444,\"\")","v":""},{"$f":"IF(Arbeitsplan!F444<>\"\",Arbeitsplan!G444,\"\")","v":{"$error":"#N/A"}},null,null,{"$f":"IF(Arbeitsplan!C444<>\"\",IF(Arbeitsplan!H444<>\"\",Arbeitsplan!H444-Arbeitsplan!G444+1,\"\"),\"\")","v":{"$error":"#N/A"}}]
[{"$f":"IF(C445<>\"\",Arbeitsplan!F445,\"\")","v":""},{"$f":"IF(Arbeitsplan!F445<>\"\",Arbeitsplan!G445,\"\")","v":""},{"$f":"IF(Arbeitsplan!A445<>\"\",IF(Arbeitsplan!H445<>\"\",Arbeitsplan!H445-Arbeitsplan!G445+1,\"\"),\"\")","v":""},{"$f":"IF(Arbeitsplan!B445<>\"\",IF(Arbeitsplan!H445<>\"\",Arbeitsplan!H445-Arbeitsplan!G445+1,\"\"),\"\")","v":""},{"$f":"IF(Arbeitsplan!C445<>\"\",IF(Arbeitsplan!H445<>\"\",Arbeitsplan!H445-Arbeitsplan!G445+1,\"\"),\"\")","v":""}]
[{"$f":"IF(C446<>\"\",Arbeitsplan!F446,\"\")","v":""},{"$f":"IF(Arbeitsplan!F446<>\"\",Arbeitsplan!G446,\"\")","v":{"$error":"#N/A"}},null,{"$f":"IF(Arbeitsplan!B446<>\"\",IF(Arbeitsplan!H446<>\"\",Arbeitsplan!H446-Arbeitsplan!G446+1,\"\"),\"\")","v":{"$error":"#N/A"}},{"$f":"IF(Arbeitsplan!C446<>\"\",IF(Arbeitsplan!H446<>\"\",Arbeitsplan!H446-Arbeitsplan!G446+1,\"\"),\"\")","v":""}]
[{"$f":"IF(C447<>\"\",Arbeitsplan!F447,\"\")","v":""},{"$f":"IF(Arbeitsplan!F447<>\"\",Arbeitsplan!G447,\"\")","v":{"$error":"#N/A"}},null,null,{"$f":"IF(Arbeitsplan!C447<>\"\",IF(Arbeitsplan!H447<>\"\",Arbeitsplan!H447-Arbeitsplan!G447+1,\"\"),\"\")","v":{"$error":"#N/A"}}]
[{"$f":"IF(C448<>\"\",Arbeitsplan!F448,\"\")","v":""},{"$f":"IF(Arbeitsplan!F448<>\"\",Arbeitsplan!G448,\"\")","v":{"$error":"#N/A"}},null,null,{"$f":"IF(Arbeitsplan!C448<>\"\",IF(Arbeitsplan!H448<>\"\",Arbeitsplan!H448-Arbeitsplan!G448+1,\"\"),\"\")","v":{"$error":"#N/A"}}]
[{"$f":"IF(C449<>\"\",Arbeitsplan!F449,\"\")","v":""},{"$f":"IF(Arbeitsplan!F449<>\"\",Arbeitsplan!G449,\"\")","v":{"$error":"#N/A"}},null,null,{"$f":"IF(Arbeitsplan!C449<>\"\",IF(Arbeitsplan!H449<>\"\",Arbeitsplan!H449-Arbeitsplan!G449+1,\"\"),\"\")","v":{"$error":"#N/A"}}]
[{"$f":"IF(C450<>\"\",Arbeitsplan!F450,\"\")","v":""},{"$f":"IF(Arbeitsplan!F450<>\"\",Arbeitsplan!G450,\"\")","v":""}]
[{"$f":"IF(C451<>\"\",Arbeitsplan!F451,\"\")","v":""},{"$f":"IF(Arbeitsplan!F451<>\"\",Arbeitsplan!G451,\"\")","v":""},{"$f":"IF(Arbeitsplan!A451<>\"\",IF(Arbeitsplan!H451<>\"\",Arbeitsplan!H451-Arbeitsplan!G451+1,\"\"),\"\")","v":""},{"$f":"IF(Arbeitsplan!B451<>\"\",IF(Arbeitsplan!H451<>\"\",Arbeitsplan!H451-Arbeitsplan!G451+1,\"\"),\"\")","v":""},{"$f":"IF(Arbeitsplan!C451<>\"\",IF(Arbeitsplan!H451<>\"\",Arbeitsplan!H451-Arbeitsplan!G451+1,\"\"),\"\")","v":""}]
[{"$f":"IF(C452<>\"\",Arbeitsplan!F452,\"\")","v":{"$error":"#N/A"}},{"$f":"IF(Arbeitsplan!F452<>\"\",Arbeitsplan!G452,\"\")","v":{"$error":"#N/A"}},{"$f":"IF(Arbeitsplan!A452<>\"\",IF(Arbeitsplan!H452<>\"\",Arbeitsplan!H452-Arbeitsplan!G452+1,\"\"),\"\")","v":{"$error":"#N/A"}},{"$f":"IF(Arbeitsplan!B452<>\"\",IF(Arbeitsplan!H452<>\"\",Arbeitsplan!H452-Arbeitsplan!G452+1,\"\"),\"\")","v":""},{"$f":"IF(Arbeitsplan!C452<>\"\",IF(Arbeitsplan!H452<>\"\",Arbeitsplan!H452-Arbeitsplan!G452+1,\"\"),\"\")","v":""}]
[{"$f":"IF(C453<>\"\",Arbeitsplan!F453,\"\")","v":""},{"$f":"IF(Arbeitsplan!F453<>\"\",Arbeitsplan!G453,\"\")","v":"00:00:00"},null,{"$f":"IF(Arbeitsplan!B453<>\"\",IF(Arbeitsplan!H453<>\"\",Arbeitsplan!H453-Arbeitsplan!G453+1,\"\"),\"\")","v":{"$error":"#N/A"}},{"$f":"IF(Arbeitsplan!C453<>\"\",IF(Arbeitsplan!H453<>\"\",Arbeitsplan!H453-Arbeitsplan!G453+1,\"\"),\"\")","v":""}]
[{"$f":"IF(C454<>\"\",Arbeitsplan!F454,\"\")","v":""},{"$f":"IF(Arbeitsplan!F454<>\"\",Arbeitsplan!G454,\"\")","v":"00:00:00"},null,null,{"$f":"IF(Arbeitsplan!C454<>\"\",IF(Arbeitsplan!H454<>\"\",Arbeitsplan!H454-Arbeitsplan!G454+1,\"\"),\"\")","v":{"$error":"#N/A"}}]
[{"$f":"IF(C455<>\"\",Arbeitsplan!F455,\"\")","v":""},{"$f":"IF(Arbeitsplan!F455<>\"\",Arbeitsplan!G455,\"\")","v":"00:00:00"},null,null,{"$f":"IF(Arbeitsplan!C455<>\"\",IF(Arbeitsplan!H455<>\"\",Arbeitsplan!H455-Arbeitsplan!G455+1,\"\"),\"\")","v":{"$error":"#N/A"}}]
[{"$f":"IF(C456<>\"\",Arbeitsplan!F456,\"\")","v":""},{"$f":"IF(Arbeitsplan!F456<>\"\",Arbeitsplan!G456,\"\")","v":"00:00:00"},null,null,{"$f":"IF(Arbeitsplan!C456<>\"\",IF(Arbeitsplan!H456<>\"\",Arbeitsplan!H456-Arbeitsplan!G456+1,\"\"),\"\")","v":{"$error":"#N/A"}}]
[{"$f":"IF(C457<>\"\",Arbeitsplan!F457,\"\")","v":""},{"$f":"IF(Arbeitsplan!F457<>\"\",Arbeitsplan!G457,\"\")","v":""},{"$f":"IF(Arbeitsplan!A457<>\"\",IF(Arbeitsplan!H457<>\"\",Arbeitsplan!H457-Arbeitsplan!G457+1,\"\"),\"\")","v":""},{"$f":"IF(Arbeitsplan!B457<>\"\",IF(Arbeitsplan!H457<>\"\",Arbeitsplan!H457-Arbeitsplan!G457+1,\"\"),\"\")","v":""},{"$f":"IF(Arbeitsplan!C457<>\"\",IF(Arbeitsplan!H457<>\"\",Arbeitsplan!H457-Arbeitsplan!G457+1,\"\"),\"\")","v":""}]
[{"$f":"IF(C458<>\"\",Arbeitsplan!F458,\"\")","v":""},{"$f":"IF(Arbeitsplan!F458<>\"\",Arbeitsplan!G458,\"\")","v":{"$error":"#N/A"}},null,{"$f":"IF(Arbeitsplan!B458<>\"\",IF(Arbeitsplan!H458<>\"\",Arbeitsplan!H458-Arbeitsplan!G458+1,\"\"),\"\")","v":{"$error":"#N/A"}},{"$f":"IF(Arbeitsplan!C458<>\"\",IF(Arbeitsplan!H458<>\"\",Arbeitsplan!H458-Arbeitsplan!G458+1,\"\"),\"\")","v":""}]
[{"$f":"IF(C459<>\"\",Arbeitsplan!F459,\"\")","v":""},{"$f":"IF(Arbeitsplan!F459<>\"\",Arbeitsplan!G459,\"\")","v":{"$error":"#N/A"}},null,null,{"$f":"IF(Arbeitsplan!C459<>\"\",IF(Arbeitsplan!H459<>\"\",Arbeitsplan!H459-Arbeitsplan!G459+1,\"\"),\"\")","v":{"$error":"#N/A"}}]
[{"$f":"IF(C460<>\"\",Arbeitsplan!F460,\"\")","v":""},{"$f":"IF(Arbeitsplan!F460<>\"\",Arbeitsplan!G460,\"\")","v":{"$error":"#N/A"}},null,null,{"$f":"IF(Arbeitsplan!C460<>\"\",IF(Arbeitsplan!H460<>\"\",Arbeitsplan!H460-Arbeitsplan!G460+1,\"\"),\"\")","v":{"$error":"#N/A"}}]
[{"$f":"IF(C461<>\"\",Arbeitsplan!F461,\"\")","v":""},{"$f":"IF(Arbeitsplan!F461<>\"\",Arbeitsplan!G461,\"\")","v":{"$error":"#N/A"}},null,null,{"$f":"IF(Arbeitsplan!C461<>\"\",IF(Arbeitsplan!H461<>\"\",Arbeitsplan!H461-Arbeitsplan!G461+1,\"\"),\"\")","v":{"$error":"#N/A"}}]
[{"$f":"IF(C462<>\"\",Arbeitsplan!F462,\"\")","v":""},{"$f":"IF(Arbeitsplan!F462<>\"\",Arbeitsplan!G462,\"\")","v":""},{"$f":"IF(Arbeitsplan!A462<>\"\",IF(Arbeitsplan!H462<>\"\",Arbeitsplan!H462-Arbeitsplan!G462+1,\"\"),\"\")","v":""},{"$f":"IF(Arbeitsplan!B462<>\"\",IF(Arbeitsplan!H462<>\"\",Arbeitsplan!H462-Arbeitsplan!G462+1,\"\"),\"\")","v":""},{"$f":"IF(Arbeitsplan!C462<>\"\",IF(Arbeitsplan!H462<>\"\",Arbeitsplan!H462-Arbeitsplan!G462+1,\"\"),\"\")","v":""}]
[{"$f":"IF(C463<>\"\",Arbeitsplan!F463,\"\")","v":""},{"$f":"IF(Arbeitsplan!F463<>\"\",Arbeitsplan!G463,\"\")","v":{"$error":"#N/A"}},null,{"$f":"IF(Arbeitsplan!B463<>\"\",IF(Arbeitsplan!H463<>\"\",Arbeitsplan!H463-Arbeitsplan!G463+1,\"\"),\"\")","v":{"$error":"#N/A"}},{"$f":"IF(Arbeitsplan!C463<>\"\",IF(Arbeitsplan!H463<>\"\",Arbeitsplan!H463-Arbeitsplan!G463+1,\"\"),\"\")","v":""}]
[{"$f":"IF(C464<>\"\",Arbeitsplan!F464,\"\")","v":""},{"$f":"IF(Arbeitsplan!F464<>\"\",Arbeitsplan!G464,\"\")","v":{"$error":"#N/A"}},null,null,{"$f":"IF(Arbeitsplan!C464<>\"\",IF(Arbeitsplan!H464<>\"\",Arbeitsplan!H464-Arbeitsplan!G464+1,\"\"),\"\")","v":{"$error":"#N/A"}}]
[{"$f":"IF(C465<>\"\",Arbeitsplan!F465,\"\")","v":""},{"$f":"IF(Arbeitsplan!F465<>\"\",Arbeitsplan!G465,\"\")","v":{"$error":"#N/A"}},null,null,{"$f":"IF(Arbeitsplan!C465<>\"\",IF(Arbeitsplan!H465<>\"\",Arbeitsplan!H465-Arbeitsplan!G465+1,\"\"),\"\")","v":{"$error":"#N/A"}}]
[{"$f":"IF(C466<>\"\",Arbeitsplan!F466,\"\")","v":""},{"$f":"IF(Arbeitsplan!F466<>\"\",Arbeitsplan!G466,\"\")","v":{"$error":"#N/A"}},null,null,{"$f":"IF(Arbeitsplan!C466<>\"\",IF(Arbeitsplan!H466<>\"\",Arbeitsplan!H466-Arbeitsplan!G466+1,\"\"),\"\")","v":{"$error":"#N/A"}}]
[{"$f":"IF(C467<>\"\",Arbeitsplan!F467,\"\")","v":""},{"$f":"IF(Arbeitsplan!F467<>\"\",Arbeitsplan!G467,\"\")","v":""},{"$f":"IF(Arbeitsplan!A467<>\"\",IF(Arbeitsplan!H467<>\"\",Arbeitsplan!H467-Arbeitsplan!G467+1,\"\"),\"\")","v":""},{"$f":"IF(Arbeitsplan!B467<>\"\",IF(Arbeitsplan!H467<>\"\",Arbeitsplan!H467-Arbeitsplan!G467+1,\"\"),\"\")","v":""},{"$f":"IF(Arbeitsplan!C467<>\"\",IF(Arbeitsplan!H467<>\"\",Arbeitsplan!H467-Arbeitsplan!G467+1,\"\"),\"\")","v":""}]
[{"$f":"IF(C468<>\"\",Arbeitsplan!F468,\"\")","v":""},{"$f":"IF(Arbeitsplan!F468<>\"\",Arbeitsplan!G468,\"\")","v":{"$error":"#N/A"}},null,{"$f":"IF(Arbeitsplan!B468<>\"\",IF(Arbeitsplan!H468<>\"\",Arbeitsplan!H468-Arbeitsplan!G468+1,\"\"),\"\")","v":{"$error":"#N/A"}},{"$f":"IF(Arbeitsplan!C468<>\"\",IF(Arbeitsplan!H468<>\"\",Arbeitsplan!H468-Arbeitsplan!G468+1,\"\"),\"\")","v":""}]
[{"$f":"IF(C469<>\"\",Arbeitsplan!F469,\"\")","v":""},{"$f":"IF(Arbeitsplan!F469<>\"\",Arbeitsplan!G469,\"\")","v":{"$error":"#N/A"}},null,null,{"$f":"IF(Arbeitsplan!C469<>\"\",IF(Arbeitsplan!H469<>\"\",Arbeitsplan!H469-Arbeitsplan!G469+1,\"\"),\"\")","v":{"$error":"#N/A"}}]
[{"$f":"IF(C470<>\"\",Arbeitsplan!F470,\"\")","v":""},{"$f":"IF(Arbeitsplan!F470<>\"\",Arbeitsplan!G470,\"\")","v":{"$error":"#N/A"}},null,null,{"$f":"IF(Arbeitsplan!C470<>\"\",IF(Arbeitsplan!H470<>\"\",Arbeitsplan!H470-Arbeitsplan!G470+1,\"\"),\"\")","v":{"$error":"#N/A"}}]
[{"$f":"IF(C471<>\"\",Arbeitsplan!F471,\"\")","v":""},{"$f":"IF(Arbeitsplan!F471<>\"\",Arbeitsplan!G471,\"\")","v":{"$error":"#N/A"}},null,null,{"$f":"IF(Arbeitsplan!C471<>\"\",IF(Arbeitsplan!H471<>\"\",Arbeitsplan!H471-Arbeitsplan!G471+1,\"\"),\"\")","v":{"$error":"#N/A"}}]
[{"$f":"IF(C472<>\"\",Arbeitsplan!F472,\"\")","v":""},{"$f":"IF(Arbeitsplan!F472<>\"\",Arbeitsplan!G472,\"\")","v":""}]
[{"$f":"IF(C473<>\"\",Arbeitsplan!F473,\"\")","v":""},{"$f":"IF(Arbeitsplan!F473<>\"\",Arbeitsplan!G473,\"\")","v":""},{"$f":"IF(Arbeitsplan!A473<>\"\",IF(Arbeitsplan!H473<>\"\",Arbeitsplan!H473-Arbeitsplan!G473+1,\"\"),\"\")","v":""},{"$f":"IF(Arbeitsplan!B473<>\"\",IF(Arbeitsplan!H473<>\"\",Arbeitsplan!H473-Arbeitsplan!G473+1,\"\"),\"\")","v":""},{"$f":"IF(Arbeitsplan!C473<>\"\",IF(Arbeitsplan!H473<>\"\",Arbeitsplan!H473-Arbeitsplan!G473+1,\"\"),\"\")","v":""}]
[{"$f":"IF(C474<>\"\",Arbeitsplan!F474,\"\")","v":{"$error":"#N/A"}},{"$f":"IF(Arbeitsplan!F474<>\"\",Arbeitsplan!G474,\"\")","v":{"$error":"#N/A"}},{"$f":"IF(Arbeitsplan!A474<>\"\",IF(Arbeitsplan!H474<>\"\",Arbeitsplan!H474-Arbeitsplan!G474+1,\"\"),\"\")","v":{"$error":"#N/A"}},{"$f":"IF(Arbeitsplan!B474<>\"\",IF(Arbeitsplan!H474<>\"\",Arbeitsplan!H474-Arbeitsplan!G474+1,\"\"),\"\")","v":""},{"$f":"IF(Arbeitsplan!C474<>\"\",IF(Arbeitsplan!H474<>\"\",Arbeitsplan!H474-Arbeitsplan!G474+1,\"\"),\"\")","v":""}]
[{"$f":"IF(C475<>\"\",Arbeitsplan!F475,\"\")","v":""},{"$f":"IF(Arbeitsplan!F475<>\"\",Arbeitsplan!G475,\"\")","v":"00:00:00"},null,{"$f":"IF(Arbeitsplan!B475<>\"\",IF(Arbeitsplan!H475<>\"\",Arbeitsplan!H475-Arbeitsplan!G475+1,\"\"),\"\")","v":{"$error":"#N/A"}},{"$f":"IF(Arbeitsplan!C475<>\"\",IF(Arbeitsplan!H475<>\"\",Arbeitsplan!H475-Arbeitsplan!G475+1,\"\"),\"\")","v":""}]
[{"$f":"IF(C476<>\"\",Arbeitsplan!F476,\"\")","v":""},{"$f":"IF(Arbeitsplan!F476<>\"\",Arbeitsplan!G476,\"\")","v":"00:00:00"},null,null,{"$f":"IF(Arbeitsplan!C476<>\"\",IF(Arbeitsplan!H476<>\"\",Arbeitsplan!H476-Arbeitsplan!G476+1,\"\"),\"\")","v":{"$error":"#N/A"}}]
[{"$f":"IF(C477<>\"\",Arbeitsplan!F477,\"\")","v":""},{"$f":"IF(Arbeitsplan!F477<>\"\",Arbeitsplan!G477,\"\")","v":"00:00:00"},null,null,{"$f":"IF(Arbeitsplan!C477<>\"\",IF(Arbeitsplan!H477<>\"\",Arbeitsplan!H477-Arbeitsplan!G477+1,\"\"),\"\")","v":{"$error":"#N/A"}}]
[{"$f":"IF(C478<>\"\",Arbeitsplan!F478,\"\")","v":""},{"$f":"IF(Arbeitsplan!F478<>\"\",Arbeitsplan!G478,\"\")","v":"00:00:00"},null,null,{"$f":"IF(Arbeitsplan!C478<>\"\",IF(Arbeitsplan!H478<>\"\",Arbeitsplan!H478-Arbeitsplan!G478+1,\"\"),\"\")","v":{"$error":"#N/A"}}]
[{"$f":"IF(C479<>\"\",Arbeitsplan!F479,\"\")","v":""},{"$f":"IF(Arbeitsplan!F479<>\"\",Arbeitsplan!G479,\"\")","v":""},{"$f":"IF(Arbeitsplan!A479<>\"\",IF(Arbeitsplan!H479<>\"\",Arbeitsplan!H479-Arbeitsplan!G479+1,\"\"),\"\")","v":""},{"$f":"IF(Arbeitsplan!B479<>\"\",IF(Arbeitsplan!H479<>\"\",Arbeitsplan!H479-Arbeitsplan!G479+1,\"\"),\"\")","v":""},{"$f":"IF(Arbeitsplan!C479<>\"\",IF(Arbeitsplan!H479<>\"\",Arbeitsplan!H479-Arbeitsplan!G479+1,\"\"),\"\")","v":""}]
[{"$f":"IF(C480<>\"\",Arbeitsplan!F480,\"\")","v":""},{"$f":"IF(Arbeitsplan!F480<>\"\",Arbeitsplan!G480,\"\")","v":{"$error":"#N/A"}},null,{"$f":"IF(Arbeitsplan!B480<>\"\",IF(Arbeitsplan!H480<>\"\",Arbeitsplan!H480-Arbeitsplan!G480+1,\"\"),\"\")","v":{"$error":"#N/A"}},{"$f":"IF(Arbeitsplan!C480<>\"\",IF(Arbeitsplan!H480<>\"\",Arbeitsplan!H480-Arbeitsplan!G480+1,\"\"),\"\")","v":""}]
[{"$f":"IF(C481<>\"\",Arbeitsplan!F481,\"\")","v":""},{"$f":"IF(Arbeitsplan!F481<>\"\",Arbeitsplan!G481,\"\")","v":{"$error":"#N/A"}},null,null,{"$f":"IF(Arbeitsplan!C481<>\"\",IF(Arbeitsplan!H481<>\"\",Arbeitsplan!H481-Arbeitsplan!G481+1,\"\"),\"\")","v":{"$error":"#N/A"}}]
[{"$f":"IF(C482<>\"\",Arbeitsplan!F482,\"\")","v":""},{"$f":"IF(Arbeitsplan!F482<>\"\",Arbeitsplan!G482,\"\")","v":{"$error":"#N/A"}},null,null,{"$f":"IF(Arbeitsplan!C482<>\"\",IF(Arbeitsplan!H482<>\"\",Arbeitsplan!H482-Arbeitsplan!G482+1,\"\"),\"\")","v":{"$error":"#N/A"}}]
[{"$f":"IF(C483<>\"\",Arbeitsplan!F483,\"\")","v":""},{"$f":"IF(Arbeitsplan!F483<>\"\",Arbeitsplan!G483,\"\")","v":{"$error":"#N/A"}},null,null,{"$f":"IF(Arbeitsplan!C483<>\"\",IF(Arbeitsplan!H483<>\"\",Arbeitsplan!H483-Arbeitsplan!G483+1,\"\"),\"\")","v":{"$error":"#N/A"}}]
[{"$f":"IF(C484<>\"\",Arbeitsplan!F484,\"\")","v":""},{"$f":"IF(Arbeitsplan!F484<>\"\",Arbeitsplan!G484,\"\")","v":""},{"$f":"IF(Arbeitsplan!A484<>\"\",IF(Arbeitsplan!H484<>\"\",Arbeitsplan!H484-Arbeitsplan!G484+1,\"\"),\"\")","v":""},{"$f":"IF(Arbeitsplan!B484<>\"\",IF(Arbeitsplan!H484<>\"\",Arbeitsplan!H484-Arbeitsplan!G484+1,\"\"),\"\")","v":""},{"$f":"IF(Arbeitsplan!C484<>\"\",IF(Arbeitsplan!H484<>\"\",Arbeitsplan!H484-Arbeitsplan!G484+1,\"\"),\"\")","v":""}]
[{"$f":"IF(C485<>\"\",Arbeitsplan!F485,\"\")","v":""},{"$f":"IF(Arbeitsplan!F485<>\"\",Arbeitsplan!G485,\"\")","v":{"$error":"#N/A"}},null,{"$f":"IF(Arbeitsplan!B485<>\"\",IF(Arbeitsplan!H485<>\"\",Arbeitsplan!H485-Arbeitsplan!G485+1,\"\"),\"\")","v":{"$error":"#N/A"}},{"$f":"IF(Arbeitsplan!C485<>\"\",IF(Arbeitsplan!H485<>\"\",Arbeitsplan!H485-Arbeitsplan!G485+1,\"\"),\"\")","v":""}]
[{"$f":"IF(C486<>\"\",Arbeitsplan!F486,\"\")","v":""},{"$f":"IF(Arbeitsplan!F486<>\"\",Arbeitsplan!G486,\"\")","v":{"$error":"#N/A"}},null,null,{"$f":"IF(Arbeitsplan!C486<>\"\",IF(Arbeitsplan!H486<>\"\",Arbeitsplan!H486-Arbeitsplan!G486+1,\"\"),\"\")","v":{"$error":"#N/A"}}]
[{"$f":"IF(C487<>\"\",Arbeitsplan!F487,\"\")","v":""},{"$f":"IF(Arbeitsplan!F487<>\"\",Arbeitsplan!G487,\"\")","v":{"$error":"#N/A"}},null,null,{"$f":"IF(Arbeitsplan!C487<>\"\",IF(Arbeitsplan!H487<>\"\",Arbeitsplan!H487-Arbeitsplan!G487+1,\"\"),\"\")","v":{"$error":"#N/A"}}]
[{"$f":"IF(C488<>\"\",Arbeitsplan!F488,\"\")","v":""},{"$f":"IF(Arbeitsplan!F488<>\"\",Arbeitsplan!G488,\"\")","v":{"$error":"#N/A"}},null,null,{"$f":"IF(Arbeitsplan!C488<>\"\",IF(Arbeitsplan!H488<>\"\",Arbeitsplan!H488-Arbeitsplan!G488+1,\"\"),\"\")","v":{"$error":"#N/A"}}]
[{"$f":"IF(C489<>\"\",Arbeitsplan!F489,\"\")","v":""},{"$f":"IF(Arbeitsplan!F489<>\"\",Arbeitsplan!G489,\"\")","v":""},{"$f":"IF(Arbeitsplan!A489<>\"\",IF(Arbeitsplan!H489<>\"\",Arbeitsplan!H489-Arbeitsplan!G489+1,\"\"),\"\")","v":""},{"$f":"IF(Arbeitsplan!B489<>\"\",IF(Arbeitsplan!H489<>\"\",Arbeitsplan!H489-Arbeitsplan!G489+1,\"\"),\"\")","v":""},{"$f":"IF(Arbeitsplan!C489<>\"\",IF(Arbeitsplan!H489<>\"\",Arbeitsplan!H489-Arbeitsplan!G489+1,\"\"),\"\")","v":""}]
[{"$f":"IF(C490<>\"\",Arbeitsplan!F490,\"\")","v":""},{"$f":"IF(Arbeitsplan!F490<>\"\",Arbeitsplan!G490,\"\")","v":{"$error":"#N/A"}},null,{"$f":"IF(Arbeitsplan!B490<>\"\",IF(Arbeitsplan!H490<>\"\",Arbeitsplan!H490-Arbeitsplan!G490+1,\"\"),\"\")","v":{"$error":"#N/A"}},{"$f":"IF(Arbeitsplan!C490<>\"\",IF(Arbeitsplan!H490<>\"\",Arbeitsplan!H490-Arbeitsplan!G490+1,\"\"),\"\")","v":""}]
[{"$f":"IF(C491<>\"\",Arbeitsplan!F491,\"\")","v":""},{"$f":"IF(Arbeitsplan!F491<>\"\",Arbeitsplan!G491,\"\")","v":{"$error":"#N/A"}},null,null,{"$f":"IF(Arbeitsplan!C491<>\"\",IF(Arbeitsplan!H491<>\"\",Arbeitsplan!H491-Arbeitsplan!G491+1,\"\"),\"\")","v":{"$error":"#N/A"}}]
[{"$f":"IF(C492<>\"\",Arbeitsplan!F492,\"\")","v":""},{"$f":"IF(Arbeitsplan!F492<>\"\",Arbeitsplan!G492,\"\")","v":{"$error":"#N/A"}},null,null,{"$f":"IF(Arbeitsplan!C492<>\"\",IF(Arbeitsplan!H492<>\"\",Arbeitsplan!H492-Arbeitsplan!G492+1,\"\"),\"\")","v":{"$error":"#N/A"}}]
[{"$f":"IF(C493<>\"\",Arbeitsplan!F493,\"\")","v":""},{"$f":"IF(Arbeitsplan!F493<>\"\",Arbeitsplan!G493,\"\")","v":{"$error":"#N/A"}},null,null,{"$f":"IF(Arbeitsplan!C493<>\"\",IF(Arbeitsplan!H493<>\"\",Arbeitsplan!H493-Arbeitsplan!G493+1,\"\"),\"\")","v":{"$error":"#N/A"}}]
[{"$f":"IF(C494<>\"\",Arbeitsplan!F494,\"\")","v":""},{"$f":"IF(Arbeitsplan!F494<>\"\",Arbeitsplan!G494,\"\")","v":""}]
[{"$f":"IF(C495<>\"\",Arbeitsplan!F495,\"\")","v":""},{"$f":"IF(Arbeitsplan!F495<>\"\",Arbeitsplan!G495,\"\")","v":""},{"$f":"IF(Arbeitsplan!A495<>\"\",IF(Arbeitsplan!H495<>\"\",Arbeitsplan!H495-Arbeitsplan!G495+1,\"\"),\"\")","v":""},{"$f":"IF(Arbeitsplan!B495<>\"\",IF(Arbeitsplan!H495<>\"\",Arbeitsplan!H495-Arbeitsplan!G495+1,\"\"),\"\")","v":""},{"$f":"IF(Arbeitsplan!C495<>\"\",IF(Arbeitsplan!H495<>\"\",Arbeitsplan!H495-Arbeitsplan!G495+1,\"\"),\"\")","v":""}]
[{"$f":"IF(C496<>\"\",Arbeitsplan!F496,\"\")","v":{"$error":"#N/A"}},{"$f":"IF(Arbeitsplan!F496<>\"\",Arbeitsplan!G496,\"\")","v":{"$error":"#N/A"}},{"$f":"IF(Arbeitsplan!A496<>\"\",IF(Arbeitsplan!H496<>\"\",Arbeitsplan!H496-Arbeitsplan!G496+1,\"\"),\"\")","v":{"$error":"#N/A"}},{"$f":"IF(Arbeitsplan!B496<>\"\",IF(Arbeitsplan!H496<>\"\",Arbeitsplan!H496-Arbeitsplan!G496+1,\"\"),\"\")","v":""},{"$f":"IF(Arbeitsplan!C496<>\"\",IF(Arbeitsplan!H496<>\"\",Arbeitsplan!H496-Arbeitsplan!G496+1,\"\"),\"\")","v":""}]
[{"$f":"IF(C497<>\"\",Arbeitsplan!F497,\"\")","v":""},{"$f":"IF(Arbeitsplan!F497<>\"\",Arbeitsplan!G497,\"\")","v":"00:00:00"},null,{"$f":"IF(Arbeitsplan!B497<>\"\",IF(Arbeitsplan!H497<>\"\",Arbeitsplan!H497-Arbeitsplan!G497+1,\"\"),\"\")","v":{"$error":"#N/A"}},{"$f":"IF(Arbeitsplan!C497<>\"\",IF(Arbeitsplan!H497<>\"\",Arbeitsplan!H497-Arbeitsplan!G497+1,\"\"),\"\")","v":""}]
[{"$f":"IF(C498<>\"\",Arbeitsplan!F498,\"\")","v":""},{"$f":"IF(Arbeitsplan!F498<>\"\",Arbeitsplan!G498,\"\")","v":"00:00:00"},null,null,{"$f":"IF(Arbeitsplan!C498<>\"\",IF(Arbeitsplan!H498<>\"\",Arbeitsplan!H498-Arbeitsplan!G498+1,\"\"),\"\")","v":{"$error":"#N/A"}}]
[{"$f":"IF(C499<>\"\",Arbeitsplan!F499,\"\")","v":""},{"$f":"IF(Arbeitsplan!F499<>\"\",Arbeitsplan!G499,\"\")","v":"00:00:00"},null,null,{"$f":"IF(Arbeitsplan!C499<>\"\",IF(Arbeitsplan!H499<>\"\",Arbeitsplan!H499-Arbeitsplan!G499+1,\"\"),\"\")","v":{"$error":"#N/A"}}]
[{"$f":"IF(C500<>\"\",Arbeitsplan!F500,\"\")","v":""},{"$f":"IF(Arbeitsplan!F500<>\"\",Arbeitsplan!G500,\"\")","v":"00:00:00"},null,null,{"$f":"IF(Arbeitsplan!C500<>\"\",IF(Arbeitsplan!H500<>\"\",Arbeitsplan!H500-Arbeitsplan!G500+1,\"\"),\"\")","v":{"$error":"#N/A"}}]
[{"$f":"IF(C501<>\"\",Arbeitsplan!F501,\"\")","v":""},{"$f":"IF(Arbeitsplan!F501<>\"\",Arbeitsplan!G501,\"\")","v":""},{"$f":"IF(Arbeitsplan!A501<>\"\",IF(Arbeitsplan!H501<>\"\",Arbeitsplan!H501-Arbeitsplan!G501+1,\"\"),\"\")","v":""},{"$f":"IF(Arbeitsplan!B501<>\"\",IF(Arbeitsplan!H501<>\"\",Arbeitsplan!H501-Arbeitsplan!G501+1,\"\"),\"\")","v":""},{"$f":"IF(Arbeitsplan!C501<>\"\",IF(Arbeitsplan!H501<>\"\",Arbeitsplan!H501-Arbeitsplan!G501+1,\"\"),\"\")","v":""}]
[{"$f":"IF(C502<>\"\",Arbeitsplan!F502,\"\")","v":""},{"$f":"IF(Arbeitsplan!F502<>\"\",Arbeitsplan!G502,\"\")","v":{"$error":"#N/A"}},null,{"$f":"IF(Arbeitsplan!B502<>\"\",IF(Arbeitsplan!H502<>\"\",Arbeitsplan!H502-Arbeitsplan!G502+1,\"\"),\"\")","v":{"$error":"#N/A"}},{"$f":"IF(Arbeitsplan!C502<>\"\",IF(Arbeitsplan!H502<>\"\",Arbeitsplan!H502-Arbeitsplan!G502+1,\"\"),\"\")","v":""}]
[{"$f":"IF(C503<>\"\",Arbeitsplan!F503,\"\")","v":""},{"$f":"IF(Arbeitsplan!F503<>\"\",Arbeitsplan!G503,\"\")","v":{"$error":"#N/A"}},null,null,{"$f":"IF(Arbeitsplan!C503<>\"\",IF(Arbeitsplan!H503<>\"\",Arbeitsplan!H503-Arbeitsplan!G503+1,\"\"),\"\")","v":{"$error":"#N/A"}}]
[{"$f":"IF(C504<>\"\",Arbeitsplan!F504,\"\")","v":""},{"$f":"IF(Arbeitsplan!F504<>\"\",Arbeitsplan!G504,\"\")","v":{"$error":"#N/A"}},null,null,{"$f":"IF(Arbeitsplan!C504<>\"\",IF(Arbeitsplan!H504<>\"\",Arbeitsplan!H504-Arbeitsplan!G504+1,\"\"),\"\")","v":{"$error":"#N/A"}}]
[{"$f":"IF(C505<>\"\",Arbeitsplan!F505,\"\")","v":""},{"$f":"IF(Arbeitsplan!F505<>\"\",Arbeitsplan!G505,\"\")","v":{"$error":"#N/A"}},null,null,{"$f":"IF(Arbeitsplan!C505<>\"\",IF(Arbeitsplan!H505<>\"\",Arbeitsplan!H505-Arbeitsplan!G505+1,\"\"),\"\")","v":{"$error":"#N/A"}}]
[{"$f":"IF(C506<>\"\",Arbeitsplan!F506,\"\")","v":""},{"$f":"IF(Arbeitsplan!F506<>\"\",Arbeitsplan!G506,\"\")","v":""},{"$f":"IF(Arbeitsplan!A506<>\"\",IF(Arbeitsplan!H506<>\"\",Arbeitsplan!H506-Arbeitsplan!G506+1,\"\"),\"\")","v":""},{"$f":"IF(Arbeitsplan!B506<>\"\",IF(Arbeitsplan!H506<>\"\",Arbeitsplan!H506-Arbeitsplan!G506+1,\"\"),\"\")","v":""},{"$f":"IF(Arbeitsplan!C506<>\"\",IF(Arbeitsplan!H506<>\"\",Arbeitsplan!H506-Arbeitsplan!G506+1,\"\"),\"\")","v":""}]
[{"$f":"IF(C507<>\"\",Arbeitsplan!F507,\"\")","v":""},{"$f":"IF(Arbeitsplan!F507<>\"\",Arbeitsplan!G507,\"\")","v":{"$error":"#N/A"}},null,{"$f":"IF(Arbeitsplan!B507<>\"\",IF(Arbeitsplan!H507<>\"\",Arbeitsplan!H507-Arbeitsplan!G507+1,\"\"),\"\")","v":{"$error":"#N/A"}},{"$f":"IF(Arbeitsplan!C507<>\"\",IF(Arbeitsplan!H507<>\"\",Arbeitsplan!H507-Arbeitsplan!G507+1,\"\"),\"\")","v":""}]
[{"$f":"IF(C508<>\"\",Arbeitsplan!F508,\"\")","v":""},{"$f":"IF(Arbeitsplan!F508<>\"\",Arbeitsplan!G508,\"\")","v":{"$error":"#N/A"}},null,null,{"$f":"IF(Arbeitsplan!C508<>\"\",IF(Arbeitsplan!H508<>\"\",Arbeitsplan!H508-Arbeitsplan!G508+1,\"\"),\"\")","v":{"$error":"#N/A"}}]
[{"$f":"IF(C509<>\"\",Arbeitsplan!F509,\"\")","v":""},{"$f":"IF(Arbeitsplan!F509<>\"\",Arbeitsplan!G509,\"\")","v":{"$error":"#N/A"}},null,null,{"$f":"IF(Arbeitsplan!C509<>\"\",IF(Arbeitsplan!H509<>\"\",Arbeitsplan!H509-Arbeitsplan!G509+1,\"\"),\"\")","v":{"$error":"#N/A"}}]
[{"$f":"IF(C510<>\"\",Arbeitsplan!F510,\"\")","v":""},{"$f":"IF(Arbeitsplan!F510<>\"\",Arbeitsplan!G510,\"\")","v":{"$error":"#N/A"}},null,null,{"$f":"IF(Arbeitsplan!C510<>\"\",IF(Arbeitsplan!H510<>\"\",Arbeitsplan!H510-Arbeitsplan!G510+1,\"\"),\"\")","v":{"$error":"#N/A"}}]
[{"$f":"IF(C511<>\"\",Arbeitsplan!F511,\"\")","v":""},{"$f":"IF(Arbeitsplan!F511<>\"\",Arbeitsplan!G511,\"\")","v":""},{"$f":"IF(Arbeitsplan!A511<>\"\",IF(Arbeitsplan!H511<>\"\",Arbeitsplan!H511-Arbeitsplan!G511+1,\"\"),\"\")","v":""},{"$f":"IF(Arbeitsplan!B511<>\"\",IF(Arbeitsplan!H511<>\"\",Arbeitsplan!H511-Arbeitsplan!G511+1,\"\"),\"\")","v":""},{"$f":"IF(Arbeitsplan!C511<>\"\",IF(Arbeitsplan!H511<>\"\",Arbeitsplan!H511-Arbeitsplan!G511+1,\"\"),\"\")","v":""}]
[{"$f":"IF(C512<>\"\",Arbeitsplan!F512,\"\")","v":""},{"$f":"IF(Arbeitsplan!F512<>\"\",Arbeitsplan!G512,\"\")","v":{"$error":"#N/A"}},null,{"$f":"IF(Arbeitsplan!B512<>\"\",IF(Arbeitsplan!H512<>\"\",Arbeitsplan!H512-Arbeitsplan!G512+1,\"\"),\"\")","v":{"$error":"#N/A"}},{"$f":"IF(Arbeitsplan!C512<>\"\",IF(Arbeitsplan!H512<>\"\",Arbeitsplan!H512-Arbeitsplan!G512+1,\"\"),\"\")","v":""}]
[{"$f":"IF(C513<>\"\",Arbeitsplan!F513,\"\")","v":""},{"$f":"IF(Arbeitsplan!F513<>\"\",Arbeitsplan!G513,\"\")","v":{"$error":"#N/A"}},null,null,{"$f":"IF(Arbeitsplan!C513<>\"\",IF(Arbeitsplan!H513<>\"\",Arbeitsplan!H513-Arbeitsplan!G513+1,\"\"),\"\")","v":{"$error":"#N/A"}}]
[{"$f":"IF(C514<>\"\",Arbeitsplan!F514,\"\")","v":""},{"$f":"IF(Arbeitsplan!F514<>\"\",Arbeitsplan!G514,\"\")","v":{"$error":"#N/A"}},null,null,{"$f":"IF(Arbeitsplan!C514<>\"\",IF(Arbeitsplan!H514<>\"\",Arbeitsplan!H514-Arbeitsplan!G514+1,\"\"),\"\")","v":{"$error":"#N/A"}}]
[{"$f":"IF(C515<>\"\",Arbeitsplan!F515,\"\")","v":""},{"$f":"IF(Arbeitsplan!F515<>\"\",Arbeitsplan!G515,\"\")","v":{"$error":"#N/A"}},null,null,{"$f":"IF(Arbeitsplan!C515<>\"\",IF(Arbeitsplan!H515<>\"\",Arbeitsplan!H515-Arbeitsplan!G515+1,\"\"),\"\")","v":{"$error":"#N/A"}}]
[{"$f":"IF(C516<>\"\",Arbeitsplan!F516,\"\")","v":""},{"$f":"IF(Arbeitsplan!F516<>\"\",Arbeitsplan!G516,\"\")","v":""}]
[{"$f":"IF(C517<>\"\",Arbeitsplan!F517,\"\")","v":""},{"$f":"IF(Arbeitsplan!F517<>\"\",Arbeitsplan!G517,\"\")","v":""},{"$f":"IF(Arbeitsplan!A517<>\"\",IF(Arbeitsplan!H517<>\"\",Arbeitsplan!H517-Arbeitsplan!G517+1,\"\"),\"\")","v":""},{"$f":"IF(Arbeitsplan!B517<>\"\",IF(Arbeitsplan!H517<>\"\",Arbeitsplan!H517-Arbeitsplan!G517+1,\"\"),\"\")","v":""},{"$f":"IF(Arbeitsplan!C517<>\"\",IF(Arbeitsplan!H517<>\"\",Arbeitsplan!H517-Arbeitsplan!G517+1,\"\"),\"\")","v":""}]
[{"$f":"IF(C518<>\"\",Arbeitsplan!F518,\"\")","v":{"$error":"#N/A"}},{"$f":"IF(Arbeitsplan!F518<>\"\",Arbeitsplan!G518,\"\")","v":{"$error":"#N/A"}},{"$f":"IF(Arbeitsplan!A518<>\"\",IF(Arbeitsplan!H518<>\"\",Arbeitsplan!H518-Arbeitsplan!G518+1,\"\"),\"\")","v":{"$error":"#N/A"}},{"$f":"IF(Arbeitsplan!B518<>\"\",IF(Arbeitsplan!H518<>\"\",Arbeitsplan!H518-Arbeitsplan!G518+1,\"\"),\"\")","v":""},{"$f":"IF(Arbeitsplan!C518<>\"\",IF(Arbeitsplan!H518<>\"\",Arbeitsplan!H518-Arbeitsplan!G518+1,\"\"),\"\")","v":""}]
[{"$f":"IF(C519<>\"\",Arbeitsplan!F519,\"\")","v":""},{"$f":"IF(Arbeitsplan!F519<>\"\",Arbeitsplan!G519,\"\")","v":"00:00:00"},null,{"$f":"IF(Arbeitsplan!B519<>\"\",IF(Arbeitsplan!H519<>\"\",Arbeitsplan!H519-Arbeitsplan!G519+1,\"\"),\"\")","v":{"$error":"#N/A"}},{"$f":"IF(Arbeitsplan!C519<>\"\",IF(Arbeitsplan!H519<>\"\",Arbeitsplan!H519-Arbeitsplan!G519+1,\"\"),\"\")","v":""}]
[{"$f":"IF(C520<>\"\",Arbeitsplan!F520,\"\")","v":""},{"$f":"IF(Arbeitsplan!F520<>\"\",Arbeitsplan!G520,\"\")","v":"00:00:00"},null,null,{"$f":"IF(Arbeitsplan!C520<>\"\",IF(Arbeitsplan!H520<>\"\",Arbeitsplan!H520-Arbeitsplan!G520+1,\"\"),\"\")","v":{"$error":"#N/A"}}]
[{"$f":"IF(C521<>\"\",Arbeitsplan!F521,\"\")","v":""},{"$f":"IF(Arbeitsplan!F521<>\"\",Arbeitsplan!G521,\"\")","v":"00:00:00"},null,null,{"$f":"IF(Arbeitsplan!C521<>\"\",IF(Arbeitsplan!H521<>\"\",Arbeitsplan!H521-Arbeitsplan!G521+1,\"\"),\"\")","v":{"$error":"#N/A"}}]
[{"$f":"IF(C522<>\"\",Arbeitsplan!F522,\"\")","v":""},{"$f":"IF(Arbeitsplan!F522<>\"\",Arbeitsplan!G522,\"\")","v":"00:00:00"},null,null,{"$f":"IF(Arbeitsplan!C522<>\"\",IF(Arbeitsplan!H522<>\"\",Arbeitsplan!H522-Arbeitsplan!G522+1,\"\"),\"\")","v":{"$error":"#N/A"}}]
[{"$f":"IF(C523<>\"\",Arbeitsplan!F523,\"\")","v":""},{"$f":"IF(Arbeitsplan!F523<>\"\",Arbeitsplan!G523,\"\")","v":""},{"$f":"IF(Arbeitsplan!A523<>\"\",IF(Arbeitsplan!H523<>\"\",Arbeitsplan!H523-Arbeitsplan!G523+1,\"\"),\"\")","v":""},{"$f":"IF(Arbeitsplan!B523<>\"\",IF(Arbeitsplan!H523<>\"\",Arbeitsplan!H523-Arbeitsplan!G523+1,\"\"),\"\")","v":""},{"$f":"IF(Arbeitsplan!C523<>\"\",IF(Arbeitsplan!H523<>\"\",Arbeitsplan!H523-Arbeitsplan!G523+1,\"\"),\"\")","v":""}]
[{"$f":"IF(C524<>\"\",Arbeitsplan!F524,\"\")","v":""},{"$f":"IF(Arbeitsplan!F524<>\"\",Arbeitsplan!G524,\"\")","v":{"$error":"#N/A"}},null,{"$f":"IF(Arbeitsplan!B524<>\"\",IF(Arbeitsplan!H524<>\"\",Arbeitsplan!H524-Arbeitsplan!G524+1,\"\"),\"\")","v":{"$error":"#N/A"}},{"$f":"IF(Arbeitsplan!C524<>\"\",IF(Arbeitsplan!H524<>\"\",Arbeitsplan!H524-Arbeitsplan!G524+1,\"\"),\"\")","v":""}]
[{"$f":"IF(C525<>\"\",Arbeitsplan!F525,\"\")","v":""},{"$f":"IF(Arbeitsplan!F525<>\"\",Arbeitsplan!G525,\"\")","v":{"$error":"#N/A"}},null,null,{"$f":"IF(Arbeitsplan!C525<>\"\",IF(Arbeitsplan!H525<>\"\",Arbeitsplan!H525-Arbeitsplan!G525+1,\"\"),\"\")","v":{"$error":"#N/A"}}]
[{"$f":"IF(C526<>\"\",Arbeitsplan!F526,\"\")","v":""},{"$f":"IF(Arbeitsplan!F526<>\"\",Arbeitsplan!G526,\"\")","v":{"$error":"#N/A"}},null,null,{"$f":"IF(Arbeitsplan!C526<>\"\",IF(Arbeitsplan!H526<>\"\",Arbeitsplan!H526-Arbeitsplan!G526+1,\"\"),\"\")","v":{"$error":"#N/A"}}]
[{"$f":"IF(C527<>\"\",Arbeitsplan!F527,\"\")","v":""},{"$f":"IF(Arbeitsplan!F527<>\"\",Arbeitsplan!G527,\"\")","v":{"$error":"#N/A"}},null,null,{"$f":"IF(Arbeitsplan!C527<>\"\",IF(Arbeitsplan!H527<>\"\",Arbeitsplan!H527-Arbeitsplan!G527+1,\"\"),\"\")","v":{"$error":"#N/A"}}]
[{"$f":"IF(C528<>\"\",Arbeitsplan!F528,\"\")","v":""},{"$f":"IF(Arbeitsplan!F528<>\"\",Arbeitsplan!G528,\"\")","v":""},{"$f":"IF(Arbeitsplan!A528<>\"\",IF(Arbeitsplan!H528<>\"\",Arbeitsplan!H528-Arbeitsplan!G528+1,\"\"),\"\")","v":""},{"$f":"IF(Arbeitsplan!B528<>\"\",IF(Arbeitsplan!H528<>\"\",Arbeitsplan!H528-Arbeitsplan!G528+1,\"\"),\"\")","v":""},{"$f":"IF(Arbeitsplan!C528<>\"\",IF(Arbeitsplan!H528<>\"\",Arbeitsplan!H528-Arbeitsplan!G528+1,\"\"),\"\")","v":""}]
[{"$f":"IF(C529<>\"\",Arbeitsplan!F529,\"\")","v":""},{"$f":"IF(Arbeitsplan!F529<>\"\",Arbeitsplan!G529,\"\")","v":{"$error":"#N/A"}},null,{"$f":"IF(Arbeitsplan!B529<>\"\",IF(Arbeitsplan!H529<>\"\",Arbeitsplan!H529-Arbeitsplan!G529+1,\"\"),\"\")","v":{"$error":"#N/A"}},{"$f":"IF(Arbeitsplan!C529<>\"\",IF(Arbeitsplan!H529<>\"\",Arbeitsplan!H529-Arbeitsplan!G529+1,\"\"),\"\")","v":""}]
[{"$f":"IF(C530<>\"\",Arbeitsplan!F530,\"\")","v":""},{"$f":"IF(Arbeitsplan!F530<>\"\",Arbeitsplan!G530,\"\")","v":{"$error":"#N/A"}},null,null,{"$f":"IF(Arbeitsplan!C530<>\"\",IF(Arbeitsplan!H530<>\"\",Arbeitsplan!H530-Arbeitsplan!G530+1,\"\"),\"\")","v":{"$error":"#N/A"}}]
[{"$f":"IF(C531<>\"\",Arbeitsplan!F531,\"\")","v":""},{"$f":"IF(Arbeitsplan!F531<>\"\",Arbeitsplan!G531,\"\")","v":{"$error":"#N/A"}},null,null,{"$f":"IF(Arbeitsplan!C531<>\"\",IF(Arbeitsplan!H531<>\"\",Arbeitsplan!H531-Arbeitsplan!G531+1,\"\"),\"\")","v":{"$error":"#N/A"}}]
[{"$f":"IF(C532<>\"\",Arbeitsplan!F532,\"\")","v":""},{"$f":"IF(Arbeitsplan!F532<>\"\",Arbeitsplan!G532,\"\")","v":{"$error":"#N/A"}},null,null,{"$f":"IF(Arbeitsplan!C532<>\"\",IF(Arbeitsplan!H532<>\"\",Arbeitsplan!H532-Arbeitsplan!G532+1,\"\"),\"\")","v":{"$error":"#N/A"}}]
[{"$f":"IF(C533<>\"\",Arbeitsplan!F533,\"\")","v":""},{"$f":"IF(Arbeitsplan!F533<>\"\",Arbeitsplan!G533,\"\")","v":""},{"$f":"IF(Arbeitsplan!A533<>\"\",IF(Arbeitsplan!H533<>\"\",Arbeitsplan!H533-Arbeitsplan!G533+1,\"\"),\"\")","v":""},{"$f":"IF(Arbeitsplan!B533<>\"\",IF(Arbeitsplan!H533<>\"\",Arbeitsplan!H533-Arbeitsplan!G533+1,\"\"),\"\")","v":""},{"$f":"IF(Arbeitsplan!C533<>\"\",IF(Arbeitsplan!H533<>\"\",Arbeitsplan!H533-Arbeitsplan!G533+1,\"\"),\"\")","v":""}]
[{"$f":"IF(C534<>\"\",Arbeitsplan!F534,\"\")","v":""},{"$f":"IF(Arbeitsplan!F534<>\"\",Arbeitsplan!G534,\"\")","v":{"$error":"#N/A"}},null,{"$f":"IF(Arbeitsplan!B534<>\"\",IF(Arbeitsplan!H534<>\"\",Arbeitsplan!H534-Arbeitsplan!G534+1,\"\"),\"\")","v":{"$error":"#N/A"}},{"$f":"IF(Arbeitsplan!C534<>\"\",IF(Arbeitsplan!H534<>\"\",Arbeitsplan!H534-Arbeitsplan!G534+1,\"\"),\"\")","v":""}]
[{"$f":"IF(C535<>\"\",Arbeitsplan!F535,\"\")","v":""},{"$f":"IF(Arbeitsplan!F535<>\"\",Arbeitsplan!G535,\"\")","v":{"$error":"#N/A"}},null,null,{"$f":"IF(Arbeitsplan!C535<>\"\",IF(Arbeitsplan!H535<>\"\",Arbeitsplan!H535-Arbeitsplan!G535+1,\"\"),\"\")","v":{"$error":"#N/A"}}]
[{"$f":"IF(C536<>\"\",Arbeitsplan!F536,\"\")","v":""},{"$f":"IF(Arbeitsplan!F536<>\"\",Arbeitsplan!G536,\"\")","v":{"$error":"#N/A"}},null,null,{"$f":"IF(Arbeitsplan!C536<>\"\",IF(Arbeitsplan!H536<>\"\",Arbeitsplan!H536-Arbeitsplan!G536+1,\"\"),\"\")","v":{"$error":"#N/A"}}]
[{"$f":"IF(C537<>\"\",Arbeitsplan!F537,\"\")","v":""},{"$f":"IF(Arbeitsplan!F537<>\"\",Arbeitsplan!G537,\"\")","v":{"$error":"#N/A"}},null,null,{"$f":"IF(Arbeitsplan!C537<>\"\",IF(Arbeitsplan!H537<>\"\",Arbeitsplan!H537-Arbeitsplan!G537+1,\"\"),\"\")","v":{"$error":"#N/A"}}]
[{"$f":"IF(C538<>\"\",Arbeitsplan!F538,\"\")","v":""},{"$f":"IF(Arbeitsplan!F538<>\"\",Arbeitsplan!G538,\"\")","v":""}]
[{"$f":"IF(C539<>\"\",Arbeitsplan!F539,\"\")","v":""},{"$f":"IF(Arbeitsplan!F539<>\"\",Arbeitsplan!G539,\"\")","v":""},{"$f":"IF(Arbeitsplan!A539<>\"\",IF(Arbeitsplan!H539<>\"\",Arbeitsplan!H539-Arbeitsplan!G539+1,\"\"),\"\")","v":""},{"$f":"IF(Arbeitsplan!B539<>\"\",IF(Arbeitsplan!H539<>\"\",Arbeitsplan!H539-Arbeitsplan!G539+1,\"\"),\"\")","v":""},{"$f":"IF(Arbeitsplan!C539<>\"\",IF(Arbeitsplan!H539<>\"\",Arbeitsplan!H539-Arbeitsplan!G539+1,\"\"),\"\")","v":""}]
[{"$f":"IF(C540<>\"\",Arbeitsplan!F540,\"\")","v":{"$error":"#N/A"}},{"$f":"IF(Arbeitsplan!F540<>\"\",Arbeitsplan!G540,\"\")","v":{"$error":"#N/A"}},{"$f":"IF(Arbeitsplan!A540<>\"\",IF(Arbeitsplan!H540<>\"\",Arbeitsplan!H540-Arbeitsplan!G540+1,\"\"),\"\")","v":{"$error":"#N/A"}},{"$f":"IF(Arbeitsplan!B540<>\"\",IF(Arbeitsplan!H540<>\"\",Arbeitsplan!H540-Arbeitsplan!G540+1,\"\"),\"\")","v":""},{"$f":"IF(Arbeitsplan!C540<>\"\",IF(Arbeitsplan!H540<>\"\",Arbeitsplan!H540-Arbeitsplan!G540+1,\"\"),\"\")","v":""}]
[{"$f":"IF(C541<>\"\",Arbeitsplan!F541,\"\")","v":""},{"$f":"IF(Arbeitsplan!F541<>\"\",Arbeitsplan!G541,\"\")","v":"00:00:00"},null,{"$f":"IF(Arbeitsplan!B541<>\"\",IF(Arbeitsplan!H541<>\"\",Arbeitsplan!H541-Arbeitsplan!G541+1,\"\"),\"\")","v":{"$error":"#N/A"}},{"$f":"IF(Arbeitsplan!C541<>\"\",IF(Arbeitsplan!H541<>\"\",Arbeitsplan!H541-Arbeitsplan!G541+1,\"\"),\"\")","v":""}]
[{"$f":"IF(C542<>\"\",Arbeitsplan!F542,\"\")","v":""},{"$f":"IF(Arbeitsplan!F542<>\"\",Arbeitsplan!G542,\"\")","v":"00:00:00"},null,null,{"$f":"IF(Arbeitsplan!C542<>\"\",IF(Arbeitsplan!H542<>\"\",Arbeitsplan!H542-Arbeitsplan!G542+1,\"\"),\"\")","v":{"$error":"#N/A"}}]
[{"$f":"IF(C543<>\"\",Arbeitsplan!F543,\"\")","v":""},{"$f":"IF(Arbeitsplan!F543<>\"\",Arbeitsplan!G543,\"\")","v":"00:00:00"},null,null,{"$f":"IF(Arbeitsplan!C543<>\"\",IF(Arbeitsplan!H543<>\"\",Arbeitsplan!H543-Arbeitsplan!G543+1,\"\"),\"\")","v":{"$error":"#N/A"}}]
[{"$f":"IF(C544<>\"\",Arbeitsplan!F544,\"\")","v":""},{"$f":"IF(Arbeitsplan!F544<>\"\",Arbeitsplan!G544,\"\")","v":"00:00:00"},null,null,{"$f":"IF(Arbeitsplan!C544<>\"\",IF(Arbeitsplan!H544<>\"\",Arbeitsplan!H544-Arbeitsplan!G544+1,\"\"),\"\")","v":{"$error":"#N/A"}}]
[{"$f":"IF(C545<>\"\",Arbeitsplan!F545,\"\")","v":""},{"$f":"IF(Arbeitsplan!F545<>\"\",Arbeitsplan!G545,\"\")","v":""},{"$f":"IF(Arbeitsplan!A545<>\"\",IF(Arbeitsplan!H545<>\"\",Arbeitsplan!H545-Arbeitsplan!G545+1,\"\"),\"\")","v":""},{"$f":"IF(Arbeitsplan!B545<>\"\",IF(Arbeitsplan!H545<>\"\",Arbeitsplan!H545-Arbeitsplan!G545+1,\"\"),\"\")","v":""},{"$f":"IF(Arbeitsplan!C545<>\"\",IF(Arbeitsplan!H545<>\"\",Arbeitsplan!H545-Arbeitsplan!G545+1,\"\"),\"\")","v":""}]
[{"$f":"IF(C546<>\"\",Arbeitsplan!F546,\"\")","v":""},{"$f":"IF(Arbeitsplan!F546<>\"\",Arbeitsplan!G546,\"\")","v":{"$error":"#N/A"}},null,{"$f":"IF(Arbeitsplan!B546<>\"\",IF(Arbeitsplan!H546<>\"\",Arbeitsplan!H546-Arbeitsplan!G546+1,\"\"),\"\")","v":{"$error":"#N/A"}},{"$f":"IF(Arbeitsplan!C546<>\"\",IF(Arbeitsplan!H546<>\"\",Arbeitsplan!H546-Arbeitsplan!G546+1,\"\"),\"\")","v":""}]
[{"$f":"IF(C547<>\"\",Arbeitsplan!F547,\"\")","v":""},{"$f":"IF(Arbeitsplan!F547<>\"\",Arbeitsplan!G547,\"\")","v":{"$error":"#N/A"}},null,null,{"$f":"IF(Arbeitsplan!C547<>\"\",IF(Arbeitsplan!H547<>\"\",Arbeitsplan!H547-Arbeitsplan!G547+1,\"\"),\"\")","v":{"$error":"#N/A"}}]
[{"$f":"IF(C548<>\"\",Arbeitsplan!F548,\"\")","v":""},{"$f":"IF(Arbeitsplan!F548<>\"\",Arbeitsplan!G548,\"\")","v":{"$error":"#N/A"}},null,null,{"$f":"IF(Arbeitsplan!C548<>\"\",IF(Arbeitsplan!H548<>\"\",Arbeitsplan!H548-Arbeitsplan!G548+1,\"\"),\"\")","v":{"$error":"#N/A"}}]
[{"$f":"IF(C549<>\"\",Arbeitsplan!F549,\"\")","v":""},{"$f":"IF(Arbeitsplan!F549<>\"\",Arbeitsplan!G549,\"\")","v":{"$error":"#N/A"}},null,null,{"$f":"IF(Arbeitsplan!C549<>\"\",IF(Arbeitsplan!H549<>\"\",Arbeitsplan!H549-Arbeitsplan!G549+1,\"\"),\"\")","v":{"$error":"#N/A"}}]
[{"$f":"IF(C550<>\"\",Arbeitsplan!F550,\"\")","v":""},{"$f":"IF(Arbeitsplan!F550<>\"\",Arbeitsplan!G550,\"\")","v":""},{"$f":"IF(Arbeitsplan!A550<>\"\",IF(Arbeitsplan!H550<>\"\",Arbeitsplan!H550-Arbeitsplan!G550+1,\"\"),\"\")","v":""},{"$f":"IF(Arbeitsplan!B550<>\"\",IF(Arbeitsplan!H550<>\"\",Arbeitsplan!H550-Arbeitsplan!G550+1,\"\"),\"\")","v":""},{"$f":"IF(Arbeitsplan!C550<>\"\",IF(Arbeitsplan!H550<>\"\",Arbeitsplan!H550-Arbeitsplan!G550+1,\"\"),\"\")","v":""}]
[{"$f":"IF(C551<>\"\",Arbeitsplan!F551,\"\")","v":""},{"$f":"IF(Arbeitsplan!F551<>\"\",Arbeitsplan!G551,\"\")","v":{"$error":"#N/A"}},null,{"$f":"IF(Arbeitsplan!B551<>\"\",IF(Arbeitsplan!H551<>\"\",Arbeitsplan!H551-Arbeitsplan!G551+1,\"\"),\"\")","v":{"$error":"#N/A"}},{"$f":"IF(Arbeitsplan!C551<>\"\",IF(Arbeitsplan!H551<>\"\",Arbeitsplan!H551-Arbeitsplan!G551+1,\"\"),\"\")","v":""}]
[{"$f":"IF(C552<>\"\",Arbeitsplan!F552,\"\")","v":""},{"$f":"IF(Arbeitsplan!F552<>\"\",Arbeitsplan!G552,\"\")","v":{"$error":"#N/A"}},null,null,{"$f":"IF(Arbeitsplan!C552<>\"\",IF(Arbeitsplan!H552<>\"\",Arbeitsplan!H552-Arbeitsplan!G552+1,\"\"),\"\")","v":{"$error":"#N/A"}}]
[{"$f":"IF(C553<>\"\",Arbeitsplan!F553,\"\")","v":""},{"$f":"IF(Arbeitsplan!F553<>\"\",Arbeitsplan!G553,\"\")","v":{"$error":"#N/A"}},null,null,{"$f":"IF(Arbeitsplan!C553<>\"\",IF(Arbeitsplan!H553<>\"\",Arbeitsplan!H553-Arbeitsplan!G553+1,\"\"),\"\")","v":{"$error":"#N/A"}}]
[{"$f":"IF(C554<>\"\",Arbeitsplan!F554,\"\")","v":""},{"$f":"IF(Arbeitsplan!F554<>\"\",Arbeitsplan!G554,\"\")","v":{"$error":"#N/A"}},null,null,{"$f":"IF(Arbeitsplan!C554<>\"\",IF(Arbeitsplan!H554<>\"\",Arbeitsplan!H554-Arbeitsplan!G554+1,\"\"),\"\")","v":{"$error":"#N/A"}}]
[{"$f":"IF(C555<>\"\",Arbeitsplan!F555,\"\")","v":""},{"$f":"IF(Arbeitsplan!F555<>\"\",Arbeitsplan!G555,\"\")","v":""},{"$f":"IF(Arbeitsplan!A555<>\"\",IF(Arbeitsplan!H555<>\"\",Arbeitsplan!H555-Arbeitsplan!G555+1,\"\"),\"\")","v":""},{"$f":"IF(Arbeitsplan!B555<>\"\",IF(Arbeitsplan!H555<>\"\",Arbeitsplan!H555-Arbeitsplan!G555+1,\"\"),\"\")","v":""},{"$f":"IF(Arbeitsplan!C555<>\"\",IF(Arbeitsplan!H555<>\"\",Arbeitsplan!H555-Arbeitsplan!G555+1,\"\"),\"\")","v":""}]
[{"$f":"IF(C556<>\"\",Arbeitsplan!F556,\"\")","v":""},{"$f":"IF(Arbeitsplan!F556<>\"\",Arbeitsplan!G556,\"\")","v":{"$error":"#N/A"}},null,{"$f":"IF(Arbeitsplan!B556<>\"\",IF(Arbeitsplan!H556<>\"\",Arbeitsplan!H556-Arbeitsplan!G556+1,\"\"),\"\")","v":{"$error":"#N/A"}},{"$f":"IF(Arbeitsplan!C556<>\"\",IF(Arbeitsplan!H556<>\"\",Arbeitsplan!H556-Arbeitsplan!G556+1,\"\"),\"\")","v":""}]
[{"$f":"IF(C557<>\"\",Arbeitsplan!F557,\"\")","v":""},{"$f":"IF(Arbeitsplan!F557<>\"\",Arbeitsplan!G557,\"\")","v":{"$error":"#N/A"}},null,null,{"$f":"IF(Arbeitsplan!C557<>\"\",IF(Arbeitsplan!H557<>\"\",Arbeitsplan!H557-Arbeitsplan!G557+1,\"\"),\"\")","v":{"$error":"#N/A"}}]
[{"$f":"IF(C558<>\"\",Arbeitsplan!F558,\"\")","v":""},{"$f":"IF(Arbeitsplan!F558<>\"\",Arbeitsplan!G558,\"\")","v":{"$error":"#N/A"}},null,null,{"$f":"IF(Arbeitsplan!C558<>\"\",IF(Arbeitsplan!H558<>\"\",Arbeitsplan!H558-Arbeitsplan!G558+1,\"\"),\"\")","v":{"$error":"#N/A"}}]
[{"$f":"IF(C559<>\"\",Arbeitsplan!F559,\"\")","v":""},{"$f":"IF(Arbeitsplan!F559<>\"\",Arbeitsplan!G559,\"\")","v":{"$error":"#N/A"}},null,null,{"$f":"IF(Arbeitsplan!C559<>\"\",IF(Arbeitsplan!H559<>\"\",Arbeitsplan!H559-Arbeitsplan!G559+1,\"\"),\"\")","v":{"$error":"#N/A"}}]
[{"$f":"IF(C560<>\"\",Arbeitsplan!F494,\"\")","v":""},{"$f":"IF(Arbeitsplan!F494<>\"\",Arbeitsplan!G494,\"\")","v":""}]
[{"$f":"IF(C561<>\"\",Arbeitsplan!F495,\"\")","v":""},{"$f":"IF(Arbeitsplan!F495<>\"\",Arbeitsplan!G495,\"\")","v":""},{"$f":"IF(Arbeitsplan!A495<>\"\",IF(Arbeitsplan!H495<>\"\",Arbeitsplan!H495-Arbeitsplan!G495+1,\"\"),\"\")","v":""},{"$f":"IF(Arbeitsplan!B495<>\"\",IF(Arbeitsplan!H495<>\"\",Arbeitsplan!H495-Arbeitsplan!G495+1,\"\"),\"\")","v":""},{"$f":"IF(Arbeitsplan!C495<>\"\",IF(Arbeitsplan!H495<>\"\",Arbeitsplan!H495-Arbeitsplan!G495+1,\"\"),\"\")","v":""}]

{"sheet":"Arbeitsplan","index":3,"n_rows":583,"n_cols":36,"rows_kept":583,"merged":[[2,1,2,2],[7,0,7,2]]}
["Arbeitsplan",{"$nulls":5},"Dauer",{"$f":"ROUND((H3-H2)/7,0)","v":39},"in Wochen"]
["Projekt:","Neues Projekt",{"$nulls":4},"Anfang","2013-01-01"]
["Stand:","2012-01-01",{"$nulls":4},"Ende","2013-09-30",{"$nulls":7},{"$f":"CONCATENATE(P7,\" \",P8)","v":"KW 14"},{"$f":"CONCATENATE(Q7,\" \",Q8)","v":"KW 18"},"KW 23","KW 27","KW 32","KW 36","KW 40","KW 45","KW 49","KW 1","KW 6","KW 10","KW 14","KW 19","KW 23","KW 27","KW 32","KW 36","KW 40","KW 45","KW 49"]
["Autor:","Dr. Volker Klügl",{"$nulls":4},"Review R2",{"$nulls":8},{"$f":"P11","v":0},{"$f":"Q11","v":0},0,45,{"v":85.00000193715096,"d":"85"},{"v":116.96666669845581,"d":"117"},{"v":120.99999982118607,"d":"121"},{"v":116.96666693687439,"d":"117"},{"v":120.99999952316284,"d":"121"},{"v":121.00000095367432,"d":"121"},{"v":105.89999866485596,"d":"106"},{"v":76.00000095367432,"d":"76"},{"v":70.80000066757202,"d":"71"},36,{"v":32.39999961853027,"d":"32"},0,0,0,0,0,0]
["Aufwandsschätzung",{"$nulls":13},"Verfügbarkeiit",{"$f":"Verfügbarkeit!A4","v":150},{"$f":"Verfügbarkeit!B4","v":150},{"$f":"Verfügbarkeit!C4","v":150},{"$f":"Verfügbarkeit!D4","v":150},{"$f":"Verfügbarkeit!E4","v":150},{"$f":"Verfügbarkeit!F4","v":150},{"$f":"Verfügbarkeit!G4","v":150},{"$f":"Verfügbarkeit!H4","v":150},{"$f":"Verfügbarkeit!I4","v":150},{"$f":"Verfügbarkeit!J4","v":150},{"$f":"Verfügbarkeit!K4","v":150},{"$f":"Verfügbarkeit!L4","v":150},{"$f":"Verfügbarkeit!M4","v":150},{"$f":"Verfügbarkeit!N4","v":150},{"$f":"Verfügbarkeit!O4","v":150},{"$f":"Verfügbarkeit!P4","v":150},{"$f":"Verfügbarkeit!Q4","v":150},{"$f":"Verfügbarkeit!R4","v":150},{"$f":"Verfügbarkeit!S4","v":150},{"$f":"Verfügbarkeit!T4","v":150},{"$f":"Verfügbarkeit!U4","v":150}]
[]
["Arbeitsplan / Workplan",{"$nulls":8},"Berechnung",{"$nulls":5},"KW","KW","KW","KW","KW","KW","KW","KW","KW","KW","KW","KW","KW","KW","KW","KW","KW","KW","KW","KW","KW"]
["ID",null,null,"ID","Mitarbeiter","Taskbezeichnung","Anfang","Ende","Schätz-",null,"Schätz",null,"Summe PT",null,null,{"$f":"WEEKNUM(P9+3)","v":14},18,23,27,32,36,40,45,49,{"$f":"WEEKNUM(Y9+3)","v":1},6,10,14,19,23,27,32,36,40,45,49]
["Ebene 1","Ebene 2","Ebene 3",{"$nulls":3},"Start date","End date","Basis","Me",null,"Summe","pro Task",null,null,"2013-04-01","2013-05-01","2013-06-01","2013-07-01","2013-08-01","2013-09-01","2013-10-01","2013-11-01","2013-12-01","2014-01-01","2014-02-01","2014-03-01","2014-04-01","2014-05-01","2014-06-01","2014-07-01","2014-08-01","2014-09-01","2014-10-01","2014-11-01","2014-12-01"]
[{"$nulls":15},"2013-04-30","2013-05-31","2013-06-30","2013-07-31","2013-08-31","2013-09-30","2013-10-31","2013-11-30","2013-12-31",{"$f":"Z9-1","v":"2014-01-31"},{"$f":"AA9-1","v":"2014-02-28"},"2014-03-31","2014-04-30","2014-05-31","2014-06-30","2014-07-31","2014-08-31","2014-09-30","2014-10-31","2014-11-30","2014-12-31"]
[{"$nulls":11},{"$f":"SUM(L12:L520)","v":{"v":1080,"d":"1080.0"}},{"$f":"SUM(M12:M520)/2","v":{"v":1080,"d":"1080.0"}},null,{"$f":"SUM(P11:AJ11)","v":{"v":1048.033335775137,"d":"1048.0"}},{"$f":"SUBTOTAL(109,(P12:P600))/2","v":0},{"$f":"SUBTOTAL(109,(Q12:Q600))/2","v":0},0,45,{"v":85.00000193715096,"d":"85"},{"v":116.96666669845581,"d":"117"},{"v":120.99999982118607,"d":"121"},{"v":116.96666693687439,"d":"117"},{"v":120.99999952316284,"d":"121"},{"v":121.00000095367432,"d":"121"},{"v":105.89999866485596,"d":"106"},{"v":76.00000095367432,"d":"76"},{"v":70.80000066757202,"d":"71"},36,{"v":32.39999961853027,"d":"32"},0,0,0,0,0,0]
[12000,{"$nulls":4},{"$f":"INDIRECT(CONCATENATE(\"Übersicht!C\",TEXT((A12-10000)/1000,0)))","v":"Projekt_1"},{"$f":"MIN(G13:G27)","v":"2013-07-01"},{"$f":"MAX(H13:H27)","v":"2013-12-28"},{"$nulls":3},{"$f":"IF(AND(J12<>\"\",K12<>\"\"),J12*K12,\"\")","v":""},{"$f":"SUMIF(A$12:A$519,A12,L$12:L$519)","v":{"v":360,"d":"360.0"}},null,{"$f":"F12","v":"Projekt_1"},{"$f":"SUM(P13:P31)","v":0},{"$f":"SUM(Q14:Q31)","v":0},0,45,{"v":45.00000098347664,"d":"45"},{"v":43.500000953674316,"d":"44"},{"v":44.99999910593033,"d":"45"},{"v":43.500000953674316,"d":"44"},45,45,{"v":37.499999046325684,"d":"37"},0,0,0,0,0,0,0,0,0,0]
[{"$f":"A12","v":12000},{"$f":"A12+100","v":12100},{"$nulls":3},{"$f":"INDIRECT(OFFSET(F13,-1,0)&\"!B1\")","v":"Studie"},{"$f":"MIN(G14:G16)","v":"2013-07-01"},{"$f":"MAX(H14:H16)","v":"2013-08-30"},{"$nulls":3},"",{"$f":"SUMIF(B$12:B$519,B13,L$12:L$519)","v":{"v":90,"d":"90.0"}}]
[{"$f":"A13","v":12000},{"$f":"B13","v":12100},{"$f":"B13+1","v":12101},null,"PL",{"$f":"OFFSET(F14,-2,0)&\" \"&OFFSET(F14,-1,0)&\" \"&INDIRECT(OFFSET(F14,-2,0)&\"!A4\")","v":"Projekt_1 Studie Projektleitung"},{"$f":"VLOOKUP(OFFSET(G14,-2,-1),Projektübersicht,3,0)","v":"2013-07-01"},{"$f":"VLOOKUP(OFFSET(H14,-2,-2),Projektübersicht,4,0)","v":"2013-08-30"},{"$f":"\"Aus Top Down \"&OFFSET(I14,-2,-3)","v":"Aus Top Down Projekt_1"},{"$f":"IF(ISNA(H14),0,1)","v":{"v":1,"d":"1.000"}},{"$f":"INDIRECT(\"'\"&OFFSET(K14,-2,-5)&\"'!B4\")","v":{"v":20,"d":"20.0"}},{"v":20,"d":"20.0"},{"$nulls":3},{"$f":"IF(ISNA($H14),0,zeitausschnitt($G14,$H14,$L14,P$9,P$10))","v":0},{"$f":"IF(ISNA($H14),0,zeitausschnitt($G14,$H14,$L14,Q$9,Q$10))","v":0},0,10,{"v":9.666666984558105,"d":"10"},0,0,0,0,0,0,0,0,0,0,0,0,0,0,0,0]
[{"$f":"A14","v":12000},{"$f":"B14","v":12100},{"$f":"C14+1","v":12102},null,"Entwicklung",{"$f":"OFFSET(F15,-3,0)&\" \"&OFFSET(F15,-2,0)&\" \"&INDIRECT(OFFSET(F15,-3,0)&\"!A5\")","v":"Projekt_1 Studie Entwicklung"},{"$f":"G14","v":"2013-07-01"},{"$f":"H14","v":"2013-08-30"},{"$f":"\"Aus Top Down \"&OFFSET(I15,-3,-3)","v":"Aus Top Down Projekt_1"},{"$f":"IF(ISNA(H15),0,1)","v":{"v":1,"d":"1.000"}},{"$f":"INDIRECT(\"'\"&OFFSET(K15,-3,-5)&\"'!B5\")","v":{"v":40,"d":"40.0"}},{"v":40,"d":"40.0"},{"$nulls":3},{"$f":"IF(ISNA($H15),0,zeitausschnitt($G15,$H15,$L15,P$9,P$10))","v":0},{"$f":"IF(ISNA($H15),0,zeitausschnitt($G15,$H15,$L15,Q$9,Q$10))","v":0},0,20,{"v":19.33333396911621,"d":"19"},0,0,0,0,0,0,0,0,0,0,0,0,0,0,0,0]
[12000,{"$f":"B15","v":12100},{"$f":"C15+1","v":12103},null,"Test",{"$f":"OFFSET(F16,-4,0)&\" \"&OFFSET(F16,-3,0)&\" \"&INDIRECT(OFFSET(F16,-4,0)&\"!A6\")","v":"Projekt_1 Studie Test"},{"$f":"G15","v":"2013-07-01"},{"$f":"H15","v":"2013-08-30"},{"$f":"\"Aus Top Down \"&OFFSET(I16,-4,-3)","v":"Aus Top Down Projekt_1"},{"$f":"IF(ISNA(H16),0,1)","v":{"v":1,"d":"1.000"}},{"$f":"INDIRECT(\"'\"&OFFSET(K16,-4,-5)&\"'!B6\")","v":{"v":30,"d":"30.0"}},{"v":30,"d":"30.0"},{"$nulls":3},{"$f":"IF(ISNA($H16),0,zeitausschnitt($G16,$H16,$L16,P$9,P$10))","v":0},0,0,15,{"v":14.5,"d":"15"},0,0,0,0,0,0,0,0,0,0,0,0,0,0,0,0]
[12000,{"$nulls":10},""]
[12000,{"$f":"B13+100","v":12200},{"$nulls":3},{"$f":"INDIRECT(OFFSET(F18,-6,0)&\"!C1\")","v":"Konzept "},{"$f":"MIN(G19:G21)","v":"2013-08-30"},{"$f":"MAX(H19:H21)","v":"2013-10-29"},{"$nulls":3},"",{"$f":"SUMIF(B$12:B$519,B18,L$12:L$519)","v":{"v":90,"d":"90.0"}}]
[12000,{"$f":"B18","v":12200},{"$f":"B18+1","v":12201},null,"PL",{"$f":"OFFSET(F19,-7,0)&\" \"&OFFSET(F19,-1,0)&\" \"&INDIRECT(OFFSET(F19,-7,0)&\"!A4\")","v":"Projekt_1 Konzept  Projektleitung"},{"$f":"VLOOKUP(OFFSET(G19,-7,-1),Projektübersicht,4,0)","v":"2013-08-30"},{"$f":"VLOOKUP(OFFSET(H19,-7,-2),Projektübersicht,5,0)","v":"2013-10-29"},{"$f":"\"Aus Top Down \"&OFFSET(I19,-7,-3)","v":"Aus Top Down Projekt_1"},{"$f":"IF(ISNA(H19),0,1)","v":{"v":1,"d":"1.000"}},{"$f":"INDIRECT(\"'\"&OFFSET(K19,-7,-5)&\"'!C4\")","v":{"v":20,"d":"20.0"}},{"v":20,"d":"20.0"},{"$nulls":3},{"$f":"IF(ISNA($H19),0,zeitausschnitt($G19,$H19,$L19,P$9,P$10))","v":0},{"$f":"IF(ISNA($H19),0,zeitausschnitt($G19,$H19,$L19,Q$9,Q$10))","v":0},0,0,{"v":0.3333333432674408,"d":"0"},{"v":9.666666984558105,"d":"10"},{"v":9.333333015441895,"d":"9"},0,0,0,0,0,0,0,0,0,0,0,0,0,0]
[12000,{"$f":"B19","v":12200},{"$f":"C19+1","v":12202},null,"Entwicklung",{"$f":"OFFSET(F20,-8,0)&\" \"&OFFSET(F20,-2,0)&\" \"&INDIRECT(OFFSET(F20,-8,0)&\"!A5\")","v":"Projekt_1 Konzept  Entwicklung"},{"$f":"G19","v":"2013-08-30"},{"$f":"H19","v":"2013-10-29"},{"$f":"\"Aus Top Down \"&OFFSET(I20,-8,-3)","v":"Aus Top Down Projekt_1"},{"$f":"IF(ISNA(H20),0,1)","v":{"v":1,"d":"1.000"}},{"$f":"INDIRECT(\"'\"&OFFSET(K20,-8,-5)&\"'!C5\")","v":{"v":40,"d":"40.0"}},{"v":40,"d":"40.0"},{"$nulls":3},{"$f":"IF(ISNA($H20),0,zeitausschnitt($G20,$H20,$L20,P$9,P$10))","v":0},0,0,0,{"v":0.6666666865348816,"d":"1"},{"v":19.33333396911621,"d":"19"},{"v":18.66666603088379,"d":"19"},0,0,0,0,0,0,0,0,0,0,0,0,0,0]
[12000,{"$f":"B20","v":12200},{"$f":"C20+1","v":12203},null,"Test",{"$f":"OFFSET(F21,-9,0)&\" \"&OFFSET(F21,-3,0)&\" \"&INDIRECT(OFFSET(F21,-9,0)&\"!A6\")","v":"Projekt_1 Konzept  Test"},{"$f":"G20","v":"2013-08-30"},{"$f":"H20","v":"2013-10-29"},{"$f":"\"Aus Top Down \"&OFFSET(I21,-9,-3)","v":"Aus Top Down Projekt_1"},{"$f":"IF(ISNA(H21),0,1)","v":{"v":1,"d":"1.000"}},{"$f":"INDIRECT(\"'\"&OFFSET(K21,-9,-5)&\"'!C6\")","v":{"v":30,"d":"30.0"}},{"v":30,"d":"30.0"},{"$nulls":3},0,0,0,0,{"v":0.5,"d":"1"},{"v":14.5,"d":"15"},14,0,0,0,0,0,0,0,0,0,0,0,0,0,0]
[12000,{"$nulls":10},""]
[12000,{"$f":"B18+100","v":12300},{"$nulls":3},{"$f":"INDIRECT(OFFSET(F23,-11,0)&\"!D1\")","v":"Entwicklung"},{"$f":"MIN(G24:G26)","v":"2013-10-29"},{"$f":"MAX(H24:H26)","v":"2013-12-28"},{"$nulls":3},"",{"$f":"SUMIF(B$12:B$519,B23,L$12:L$519)","v":{"v":90,"d":"90.0"}}]
[12000,{"$f":"B23","v":12300},{"$f":"B23+1","v":12301},null,"PL",{"$f":"OFFSET(F24,-12,0)&\" \"&OFFSET(F24,-1,0)&\" \"&INDIRECT(OFFSET(F24,-12,0)&\"!A4\")","v":"Projekt_1 Entwicklung Projektleitung"},{"$f":"VLOOKUP(OFFSET(G24,-12,-1),Projektübersicht,5,0)","v":"2013-10-29"},{"$f":"VLOOKUP(OFFSET(H24,-12,-2),Projektübersicht,6,0)","v":"2013-12-28"},{"$f":"\"Aus Top Down \"&OFFSET(I24,-12,-3)","v":"Aus Top Down Projekt_1"},{"$f":"IF(ISNA(H24),0,1)","v":{"v":1,"d":"1.000"}},{"$f":"INDIRECT(\"'\"&OFFSET(K24,-12,-5)&\"'!D4\")","v":{"v":20,"d":"20.0"}},{"v":20,"d":"20.0"},{"$nulls":3},{"$f":"IF(ISNA($H24),0,zeitausschnitt($G24,$H24,$L24,P$9,P$10))","v":0},{"$f":"IF(ISNA($H24),0,zeitausschnitt($G24,$H24,$L24,Q$9,Q$10))","v":0},0,0,0,0,{"v":0.6666666865348816,"d":"1"},{"v":9.666666984558105,"d":"10"},9,0,0,0,0,0,0,0,0,0,0,0,0]
[12000,{"$f":"B24","v":12300},{"$f":"C24+1","v":12302},null,"Entwicklung",{"$f":"OFFSET(F25,-13,0)&\" \"&OFFSET(F25,-2,0)&\" \"&INDIRECT(OFFSET(F25,-13,0)&\"!A5\")","v":"Projekt_1 Entwicklung Entwicklung"},{"$f":"G24","v":"2013-10-29"},{"$f":"H24","v":"2013-12-28"},{"$f":"\"Aus Top Down \"&OFFSET(I25,-13,-3)","v":"Aus Top Down Projekt_1"},{"$f":"IF(ISNA(H25),0,1)","v":{"v":1,"d":"1.000"}},{"$f":"INDIRECT(\"'\"&OFFSET(K25,-13,-5)&\"'!D5\")","v":{"v":40,"d":"40.0"}},{"v":40,"d":"40.0"},{"$nulls":3},{"$f":"IF(ISNA($H25),0,zeitausschnitt($G25,$H25,$L25,P$9,P$10))","v":0},0,0,0,0,0,{"v":1.3333333730697632,"d":"1"},{"v":19.33333396911621,"d":"19"},18,0,0,0,0,0,0,0,0,0,0,0,0]
[12000,{"$f":"B25","v":12300},{"$f":"C25+1","v":12303},null,"Test",{"$f":"OFFSET(F26,-14,0)&\" \"&OFFSET(F26,-3,0)&\" \"&INDIRECT(OFFSET(F26,-14,0)&\"!A6\")","v":"Projekt_1 Entwicklung Test"},{"$f":"G25","v":"2013-10-29"},{"$f":"H25","v":"2013-12-28"},{"$f":"\"Aus Top Down \"&OFFSET(I26,-14,-3)","v":"Aus Top Down Projekt_1"},{"$f":"IF(ISNA(H26),0,1)","v":{"v":1,"d":"1.000"}},{"$f":"INDIRECT(\"'\"&OFFSET(K26,-14,-5)&\"'!D6\")","v":{"v":30,"d":"30.0"}},{"v":30,"d":"30.0"},{"$nulls":3},0,0,0,0,0,0,1,{"v":14.5,"d":"15"},{"v":13.5,"d":"14"},0,0,0,0,0,0,0,0,0,0,0,0]
[12000,{"$nulls":10},""]
[12000,{"$f":"B23+100","v":12400},{"$nulls":3},{"$f":"INDIRECT(OFFSET(F28,-16,0)&\"!E1\")","v":"Pflege"},{"$f":"MIN(G29:G31)","v":"2013-12-28"},{"$f":"MAX(H29:H31)","v":"2014-02-26"},{"$nulls":3},"",{"$f":"SUMIF(B$12:B$519,B28,L$12:L$519)","v":{"v":90,"d":"90.0"}}]
[12000,{"$f":"B28","v":12400},{"$f":"B28+1","v":12401},null,"PL",{"$f":"OFFSET(F29,-17,0)&\" \"&OFFSET(F29,-1,0)&\" \"&INDIRECT(OFFSET(F29,-17,0)&\"!A4\")","v":"Projekt_1 Pflege Projektleitung"},{"$f":"VLOOKUP(OFFSET(G29,-17,-1),Projektübersicht,6,0)","v":"2013-12-28"},{"$f":"VLOOKUP(OFFSET(H29,-17,-2),Projektübersicht,7,0)","v":"2014-02-26"},{"$f":"\"Aus Top Down \"&OFFSET(I29,-17,-3)","v":"Aus Top Down Projekt_1"},{"$f":"IF(ISNA(H29),0,1)","v":{"v":1,"d":"1.000"}},{"$f":"INDIRECT(\"'\"&OFFSET(K29,-17,-5)&\"'!E4\")","v":{"v":20,"d":"20.0"}},{"v":20,"d":"20.0"},{"$nulls":3},{"$f":"IF(ISNA($H29),0,zeitausschnitt($G29,$H29,$L29,P$9,P$10))","v":0},{"$f":"IF(ISNA($H29),0,zeitausschnitt($G29,$H29,$L29,Q$9,Q$10))","v":0},0,0,0,0,0,0,1,10,{"v":8.333333015441895,"d":"8"},0,0,0,0,0,0,0,0,0,0]
[12000,{"$f":"B29","v":12400},{"$f":"C29+1","v":12402},null,"Entwicklung",{"$f":"OFFSET(F30,-18,0)&\" \"&OFFSET(F30,-2,0)&\" \"&INDIRECT(OFFSET(F30,-18,0)&\"!A5\")","v":"Projekt_1 Pflege Entwicklung"},{"$f":"G29","v":"2013-12-28"},{"$f":"H29","v":"2014-02-26"},{"$f":"\"Aus Top Down \"&OFFSET(I30,-18,-3)","v":"Aus Top Down Projekt_1"},{"$f":"IF(ISNA(H30),0,1)","v":{"v":1,"d":"1.000"}},{"$f":"INDIRECT(\"'\"&OFFSET(K30,-18,-5)&\"'!E5\")","v":{"v":40,"d":"40.0"}},{"v":40,"d":"40.0"},{"$nulls":3},{"$f":"IF(ISNA($H30),0,zeitausschnitt($G30,$H30,$L30,P$9,P$10))","v":0},0,0,0,0,0,0,0,2,20,{"v":16.66666603088379,"d":"17"},0,0,0,0,0,0,0,0,0,0]
[12000,{"$f":"B30","v":12400},{"$f":"C30+1","v":12403},null,"Test",{"$f":"OFFSET(F31,-19,0)&\" \"&OFFSET(F31,-3,0)&\" \"&INDIRECT(OFFSET(F31,-19,0)&\"!A6\")","v":"Projekt_1 Pflege Test"},{"$f":"G30","v":"2013-12-28"},{"$f":"H30","v":"2014-02-26"},{"$f":"\"Aus Top Down \"&OFFSET(I31,-19,-3)","v":"Aus Top Down Projekt_1"},{"$f":"IF(ISNA(H31),0,1)","v":{"v":1,"d":"1.000"}},{"$f":"INDIRECT(\"'\"&OFFSET(K31,-19,-5)&\"'!E6\")","v":{"v":30,"d":"30.0"}},{"v":30,"d":"30.0"},{"$nulls":3},0,0,0,0,0,0,0,0,{"v":1.5,"d":"2"},15,{"v":12.5,"d":"13"},0,0,0,0,0,0,0,0,0,0]
[12000,{"$nulls":10},""]
[{"$nulls":11},""]
[{"$f":"A12+1000","v":13000},{"$nulls":4},{"$f":"INDIRECT(CONCATENATE(\"Übersicht!C\",TEXT((A34-10000)/1000,0)))","v":"Projekt_2"},{"$f":"MIN(G35:G49)","v":"2013-08-01"},{"$f":"MAX(H35:H49)","v":"2014-02-19T12:00:00"},{"$nulls":3},"",{"$f":"SUMIF(A$12:A$519,A34,L$12:L$519)","v":{"v":360,"d":"360.0"}},null,{"$f":"F34","v":"Projekt_2"},{"$f":"SUM(P36:P53)","v":0},{"$f":"SUM(Q36:Q53)","v":0},0,0,{"v":40.000000953674316,"d":"40"},{"v":38.66666603088379,"d":"39"},{"v":40.00000071525574,"d":"40"},{"v":38.66666603088379,"d":"39"},{"v":39.99999952316284,"d":"40"},{"v":40.000000953674316,"d":"40"},36,{"v":40.000000953674316,"d":"40"},36,0,0,0,0,0,0,0,0]
[{"$f":"A34","v":13000},{"$f":"A34+100","v":13100},{"$nulls":3},{"$f":"INDIRECT(OFFSET(F35,-1,0)&\"!B1\")","v":"Studie"},{"$f":"MIN(G36:G38)","v":"2013-08-01"},{"$f":"MAX(H36:H38)","v":"2013-10-07T12:00:00"},{"$nulls":3},"",{"$f":"SUMIF(B$12:B$519,B35,L$12:L$519)","v":{"v":90,"d":"90.0"}}]
[{"$f":"A35","v":13000},{"$f":"B35","v":13100},{"$f":"B35+1","v":13101},null,"PL",{"$f":"OFFSET(F36,-2,0)&\" \"&OFFSET(F36,-1,0)&\" \"&INDIRECT(OFFSET(F36,-2,0)&\"!A4\")","v":"Projekt_2 Studie Projektleitung"},{"$f":"VLOOKUP(OFFSET(G36,-2,-1),Projektübersicht,3,0)","v":"2013-08-01"},{"$f":"VLOOKUP(OFFSET(H36,-2,-2),Projektübersicht,4,0)","v":"2013-10-07T12:00:00"},{"$f":"\"Aus Top Down \"&OFFSET(I36,-2,-3)","v":"Aus Top Down Projekt_2"},{"$f":"IF(ISNA(H36),0,1)","v":{"v":1,"d":"1.000"}},{"$f":"INDIRECT(\"'\"&OFFSET(K36,-2,-5)&\"'!B4\")","v":{"v":20,"d":"20.0"}},{"v":20,"d":"20.0"},{"$nulls":3},{"$f":"IF(ISNA($H36),0,zeitausschnitt($G36,$H36,$L36,P$9,P$10))","v":0},{"$f":"IF(ISNA($H36),0,zeitausschnitt($G36,$H36,$L36,Q$9,Q$10))","v":0},0,0,{"v":8.88888931274414,"d":"9"},{"v":8.592592239379883,"d":"9"},{"v":1.9259259700775146,"d":"2"},0,0,0,0,0,0,0,0,0,0,0,0,0,0]
[{"$f":"A36","v":13000},{"$f":"B36","v":13100},{"$f":"C36+1","v":13102},null,"Entwicklung",{"$f":"OFFSET(F37,-3,0)&\" \"&OFFSET(F37,-2,0)&\" \"&INDIRECT(OFFSET(F37,-3,0)&\"!A5\")","v":"Projekt_2 Studie Entwicklung"},{"$f":"G36","v":"2013-08-01"},{"$f":"H36","v":"2013-10-07T12:00:00"},{"$f":"\"Aus Top Down \"&OFFSET(I37,-3,-3)","v":"Aus Top Down Projekt_2"},{"$f":"IF(ISNA(H37),0,1)","v":{"v":1,"d":"1.000"}},{"$f":"INDIRECT(\"'\"&OFFSET(K37,-3,-5)&\"'!B5\")","v":{"v":40,"d":"40.0"}},{"v":40,"d":"40.0"},{"$nulls":3},{"$f":"IF(ISNA($H37),0,zeitausschnitt($G37,$H37,$L37,P$9,P$10))","v":0},0,0,0,{"v":17.77777862548828,"d":"18"},{"v":17.185184478759766,"d":"17"},{"v":3.8518519401550293,"d":"4"},0,0,0,0,0,0,0,0,0,0,0,0,0,0]
[13000,{"$f":"B37","v":13100},{"$f":"C37+1","v":13103},null,"Test",{"$f":"OFFSET(F38,-4,0)&\" \"&OFFSET(F38,-3,0)&\" \"&INDIRECT(OFFSET(F38,-4,0)&\"!A6\")","v":"Projekt_2 Studie Test"},{"$f":"G37","v":"2013-08-01"},{"$f":"H37","v":"2013-10-07T12:00:00"},{"$f":"\"Aus Top Down \"&OFFSET(I38,-4,-3)","v":"Aus Top Down Projekt_2"},{"$f":"IF(ISNA(H38),0,1)","v":{"v":1,"d":"1.000"}},{"$f":"INDIRECT(\"'\"&OFFSET(K38,-4,-5)&\"'!B6\")","v":{"v":30,"d":"30.0"}},{"v":30,"d":"30.0"},{"$nulls":3},0,0,0,0,{"v":13.333333015441895,"d":"13"},{"v":12.88888931274414,"d":"13"},{"v":2.8888888359069824,"d":"3"},0,0,0,0,0,0,0,0,0,0,0,0,0,0]
[13000,{"$nulls":10},""]
[13000,{"$f":"B35+100","v":13200},{"$nulls":3},{"$f":"INDIRECT(OFFSET(F40,-6,0)&\"!C1\")","v":"Konzept "},{"$f":"MIN(G41:G43)","v":"2013-10-07T12:00:00"},{"$f":"MAX(H41:H43)","v":"2013-12-14"},{"$nulls":3},"",{"$f":"SUMIF(B$12:B$519,B40,L$12:L$519)","v":{"v":90,"d":"90.0"}}]
[13000,{"$f":"B40","v":13200},{"$f":"B40+1","v":13201},null,"PL",{"$f":"OFFSET(F41,-7,0)&\" \"&OFFSET(F41,-1,0)&\" \"&INDIRECT(OFFSET(F41,-7,0)&\"!A4\")","v":"Projekt_2 Konzept  Projektleitung"},{"$f":"VLOOKUP(OFFSET(G41,-7,-1),Projektübersicht,4,0)","v":"2013-10-07T12:00:00"},{"$f":"VLOOKUP(OFFSET(H41,-7,-2),Projektübersicht,5,0)","v":"2013-12-14"},{"$f":"\"Aus Top Down \"&OFFSET(I41,-7,-3)","v":"Aus Top Down Projekt_2"},{"$f":"IF(ISNA(H41),0,1)","v":{"v":1,"d":"1.000"}},{"$f":"INDIRECT(\"'\"&OFFSET(K41,-7,-5)&\"'!C4\")","v":{"v":20,"d":"20.0"}},{"v":20,"d":"20.0"},{"$nulls":3},{"$f":"IF(ISNA($H41),0,zeitausschnitt($G41,$H41,$L41,P$9,P$10))","v":0},{"$f":"IF(ISNA($H41),0,zeitausschnitt($G41,$H41,$L41,Q$9,Q$10))","v":0},0,0,0,0,{"v":6.962963104248047,"d":"7"},{"v":8.592592239379883,"d":"9"},{"v":3.8518519401550293,"d":"4"},0,0,0,0,0,0,0,0,0,0,0,0]
[13000,{"$f":"B41","v":13200},{"$f":"C41+1","v":13202},null,"Entwicklung",{"$f":"OFFSET(F42,-8,0)&\" \"&OFFSET(F42,-2,0)&\" \"&INDIRECT(OFFSET(F42,-8,0)&\"!A5\")","v":"Projekt_2 Konzept  Entwicklung"},{"$f":"G41","v":"2013-10-07T12:00:00"},{"$f":"H41","v":"2013-12-14"},{"$f":"\"Aus Top Down \"&OFFSET(I42,-8,-3)","v":"Aus Top Down Projekt_2"},{"$f":"IF(ISNA(H42),0,1)","v":{"v":1,"d":"1.000"}},{"$f":"INDIRECT(\"'\"&OFFSET(K42,-8,-5)&\"'!C5\")","v":{"v":40,"d":"40.0"}},{"v":40,"d":"40.0"},{"$nulls":3},{"$f":"IF(ISNA($H42),0,zeitausschnitt($G42,$H42,$L42,P$9,P$10))","v":0},0,0,0,0,0,{"v":13.925926208496094,"d":"14"},{"v":17.185184478759766,"d":"17"},{"v":7.703703880310059,"d":"8"},0,0,0,0,0,0,0,0,0,0,0,0]
[13000,{"$f":"B42","v":13200},{"$f":"C42+1","v":13203},null,"Test",{"$f":"OFFSET(F43,-9,0)&\" \"&OFFSET(F43,-3,0)&\" \"&INDIRECT(OFFSET(F43,-9,0)&\"!A6\")","v":"Projekt_2 Konzept  Test"},{"$f":"G42","v":"2013-10-07T12:00:00"},{"$f":"H42","v":"2013-12-14"},{"$f":"\"Aus Top Down \"&OFFSET(I43,-9,-3)","v":"Aus Top Down Projekt_2"},{"$f":"IF(ISNA(H43),0,1)","v":{"v":1,"d":"1.000"}},{"$f":"INDIRECT(\"'\"&OFFSET(K43,-9,-5)&\"'!C6\")","v":{"v":30,"d":"30.0"}},{"v":30,"d":"30.0"},{"$nulls":3},0,0,0,0,0,0,{"v":10.44444465637207,"d":"10"},{"v":12.88888931274414,"d":"13"},{"v":5.777777671813965,"d":"6"},0,0,0,0,0,0,0,0,0,0,0,0]
[13000,{"$nulls":10},{"$f":"IF(AND(J44<>\"\",K44<>\"\"),J44*K44,\"\")","v":""}]
[13000,{"$f":"B40+100","v":13300},{"$nulls":3},{"$f":"INDIRECT(OFFSET(F45,-11,0)&\"!D1\")","v":"Entwicklung"},{"$f":"MIN(G46:G48)","v":"2013-12-14"},{"$f":"MAX(H46:H48)","v":"2014-02-19T12:00:00"},{"$nulls":3},"",{"$f":"SUMIF(B$12:B$519,B45,L$12:L$519)","v":{"v":90,"d":"90.0"}}]
[13000,{"$f":"B45","v":13300},{"$f":"B45+1","v":13301},null,"PL",{"$f":"OFFSET(F46,-12,0)&\" \"&OFFSET(F46,-1,0)&\" \"&INDIRECT(OFFSET(F46,-12,0)&\"!A4\")","v":"Projekt_2 Entwicklung Projektleitung"},{"$f":"VLOOKUP(OFFSET(G46,-12,-1),Projektübersicht,5,0)","v":"2013-12-14"},{"$f":"VLOOKUP(OFFSET(H46,-12,-2),Projektübersicht,6,0)","v":"2014-02-19T12:00:00"},{"$f":"\"Aus Top Down \"&OFFSET(I46,-12,-3)","v":"Aus Top Down Projekt_2"},{"$f":"IF(ISNA(H46),0,1)","v":{"v":1,"d":"1.000"}},{"$f":"INDIRECT(\"'\"&OFFSET(K46,-12,-5)&\"'!D4\")","v":{"v":20,"d":"20.0"}},{"v":20,"d":"20.0"},{"$nulls":3},{"$f":"IF(ISNA($H46),0,zeitausschnitt($G46,$H46,$L46,P$9,P$10))","v":0},{"$f":"IF(ISNA($H46),0,zeitausschnitt($G46,$H46,$L46,Q$9,Q$10))","v":0},0,0,0,0,0,0,{"v":5.037036895751953,"d":"5"},{"v":8.88888931274414,"d":"9"},{"v":5.481481552124023,"d":"5"},0,0,0,0,0,0,0,0,0,0]
[13000,{"$f":"B46","v":13300},{"$f":"C46+1","v":13302},null,"Entwicklung",{"$f":"OFFSET(F47,-13,0)&\" \"&OFFSET(F47,-2,0)&\" \"&INDIRECT(OFFSET(F47,-13,0)&\"!A5\")","v":"Projekt_2 Entwicklung Entwicklung"},{"$f":"G46","v":"2013-12-14"},{"$f":"H46","v":"2014-02-19T12:00:00"},{"$f":"\"Aus Top Down \"&OFFSET(I47,-13,-3)","v":"Aus Top Down Projekt_2"},{"$f":"IF(ISNA(H47),0,1)","v":{"v":1,"d":"1.000"}},{"$f":"INDIRECT(\"'\"&OFFSET(K47,-13,-5)&\"'!D5\")","v":{"v":40,"d":"40.0"}},{"v":40,"d":"40.0"},{"$nulls":3},{"$f":"IF(ISNA($H47),0,zeitausschnitt($G47,$H47,$L47,P$9,P$10))","v":0},0,0,0,0,0,0,0,{"v":10.074073791503906,"d":"10"},{"v":17.77777862548828,"d":"18"},{"v":10.962963104248047,"d":"11"},0,0,0,0,0,0,0,0,0,0]
[13000,{"$f":"B47","v":13300},{"$f":"C47+1","v":13303},null,"Test",{"$f":"OFFSET(F48,-14,0)&\" \"&OFFSET(F48,-3,0)&\" \"&INDIRECT(OFFSET(F48,-14,0)&\"!A6\")","v":"Projekt_2 Entwicklung Test"},{"$f":"G47","v":"2013-12-14"},{"$f":"H47","v":"2014-02-19T12:00:00"},{"$f":"\"Aus Top Down \"&OFFSET(I48,-14,-3)","v":"Aus Top Down Projekt_2"},{"$f":"IF(ISNA(H48),0,1)","v":{"v":1,"d":"1.000"}},{"$f":"INDIRECT(\"'\"&OFFSET(K48,-14,-5)&\"'!D6\")","v":{"v":30,"d":"30.0"}},{"v":30,"d":"30.0"},{"$nulls":3},0,0,0,0,0,0,0,0,{"v":7.55555534362793,"d":"8"},{"v":13.333333015441895,"d":"13"},{"v":8.222222328186035,"d":"8"},0,0,0,0,0,0,0,0,0,0]
[13000,{"$nulls":10},""]
[13000,{"$f":"B45+100","v":13400},{"$nulls":3},{"$f":"INDIRECT(OFFSET(F50,-16,0)&\"!E1\")","v":"Pflege"},{"$f":"MIN(G51:G53)","v":"2014-02-19T12:00:00"},{"$f":"MAX(H51:H53)","v":"2014-04-28"},{"$nulls":3},"",{"$f":"SUMIF(B$12:B$519,B50,L$12:L$519)","v":{"v":90,"d":"90.0"}}]
[13000,{"$f":"B50","v":13400},{"$f":"B50+1","v":13401},null,"PL",{"$f":"OFFSET(F51,-17,0)&\" \"&OFFSET(F51,-1,0)&\" \"&INDIRECT(OFFSET(F51,-17,0)&\"!A4\")","v":"Projekt_2 Pflege Projektleitung"},{"$f":"VLOOKUP(OFFSET(G51,-17,-1),Projektübersicht,6,0)","v":"2014-02-19T12:00:00"},{"$f":"VLOOKUP(OFFSET(H51,-17,-2),Projektübersicht,7,0)","v":"2014-04-28"},{"$f":"\"Aus Top Down \"&OFFSET(I51,-17,-3)","v":"Aus Top Down Projekt_2"},{"$f":"IF(ISNA(H51),0,1)","v":{"v":1,"d":"1.000"}},{"$f":"INDIRECT(\"'\"&OFFSET(K51,-17,-5)&\"'!E4\")","v":{"v":20,"d":"20.0"}},{"v":20,"d":"20.0"},{"$nulls":3},{"$f":"IF(ISNA($H51),0,zeitausschnitt($G51,$H51,$L51,P$9,P$10))","v":0},{"$f":"IF(ISNA($H51),0,zeitausschnitt($G51,$H51,$L51,Q$9,Q$10))","v":0},0,0,0,0,0,0,0,0,{"v":2.5185184478759766,"d":"3"},{"v":8.88888931274414,"d":"9"},8,0,0,0,0,0,0,0,0]
[13000,{"$f":"B51","v":13400},{"$f":"C51+1","v":13402},null,"Entwicklung",{"$f":"OFFSET(F52,-18,0)&\" \"&OFFSET(F52,-2,0)&\" \"&INDIRECT(OFFSET(F52,-18,0)&\"!A5\")","v":"Projekt_2 Pflege Entwicklung"},{"$f":"G51","v":"2014-02-19T12:00:00"},{"$f":"H51","v":"2014-04-28"},{"$f":"\"Aus Top Down \"&OFFSET(I52,-18,-3)","v":"Aus Top Down Projekt_2"},{"$f":"IF(ISNA(H52),0,1)","v":{"v":1,"d":"1.000"}},{"$f":"INDIRECT(\"'\"&OFFSET(K52,-18,-5)&\"'!E5\")","v":{"v":40,"d":"40.0"}},{"v":40,"d":"40.0"},{"$nulls":3},{"$f":"IF(ISNA($H52),0,zeitausschnitt($G52,$H52,$L52,P$9,P$10))","v":0},0,0,0,0,0,0,0,0,0,{"v":5.037036895751953,"d":"5"},{"v":17.77777862548828,"d":"18"},16,0,0,0,0,0,0,0,0]
[13000,{"$f":"B52","v":13400},{"$f":"C52+1","v":13403},null,"Test",{"$f":"OFFSET(F53,-19,0)&\" \"&OFFSET(F53,-3,0)&\" \"&INDIRECT(OFFSET(F53,-19,0)&\"!A6\")","v":"Projekt_2 Pflege Test"},{"$f":"G52","v":"2014-02-19T12:00:00"},{"$f":"H52","v":"2014-04-28"},{"$f":"\"Aus Top Down \"&OFFSET(I53,-19,-3)","v":"Aus Top Down Projekt_2"},{"$f":"IF(ISNA(H53),0,1)","v":{"v":1,"d":"1.000"}},{"$f":"INDIRECT(\"'\"&OFFSET(K53,-19,-5)&\"'!E6\")","v":{"v":30,"d":"30.0"}},{"v":30,"d":"30.0"},{"$nulls":3},0,0,0,0,0,0,0,0,0,0,{"v":3.777777671813965,"d":"4"},{"v":13.333333015441895,"d":"13"},12,0,0,0,0,0,0,0,0]
[13000,{"$nulls":10},""]
[{"$nulls":11},""]
[{"$f":"A34+1000","v":14000},{"$nulls":4},{"$f":"INDIRECT(CONCATENATE(\"Übersicht!C\",TEXT((A56-10000)/1000,0)))","v":"Projekt_3"},{"$f":"MIN(G57:G71)","v":"2013-09-01"},{"$f":"MAX(H57:H71)","v":"2014-04-14"},{"$nulls":3},"",{"$f":"SUMIF(A$12:A$519,A56,L$12:L$519)","v":{"v":360,"d":"360.0"}},null,{"$f":"F56","v":"Projekt_3"},{"$f":"SUM(P58:P75)","v":0},{"$f":"SUM(Q58:Q75)","v":0},0,0,0,{"v":34.799999713897705,"d":"35"},36,{"v":34.799999952316284,"d":"35"},36,36,{"v":32.39999961853027,"d":"32"},36,{"v":34.80000066757202,"d":"35"},36,{"v":32.39999961853027,"d":"32"},0,0,0,0,0,0]
[{"$f":"A56","v":14000},{"$f":"A56+100","v":14100},{"$nulls":3},{"$f":"INDIRECT(OFFSET(F57,-1,0)&\"!B1\")","v":"Studie"},{"$f":"MIN(G58:G60)","v":"2013-09-01"},{"$f":"MAX(H58:H60)","v":"2013-11-15"},{"$nulls":3},"",{"$f":"SUMIF(B$12:B$519,B57,L$12:L$519)","v":{"v":90,"d":"90.0"}}]
[{"$f":"A57","v":14000},{"$f":"B57","v":14100},{"$f":"B57+1","v":14101},null,"PL",{"$f":"OFFSET(F58,-2,0)&\" \"&OFFSET(F58,-1,0)&\" \"&INDIRECT(OFFSET(F58,-2,0)&\"!A4\")","v":"Projekt_3 Studie Projektleitung"},{"$f":"VLOOKUP(OFFSET(G58,-2,-1),Projektübersicht,3,0)","v":"2013-09-01"},{"$f":"VLOOKUP(OFFSET(H58,-2,-2),Projektübersicht,4,0)","v":"2013-11-15"},{"$f":"\"Aus Top Down \"&OFFSET(I58,-2,-3)","v":"Aus Top Down Projekt_3"},{"$f":"IF(ISNA(H58),0,1)","v":{"v":1,"d":"1.000"}},{"$f":"INDIRECT(\"'\"&OFFSET(K58,-2,-5)&\"'!B4\")","v":{"v":20,"d":"20.0"}},{"v":20,"d":"20.0"},{"$nulls":3},{"$f":"IF(ISNA($H58),0,zeitausschnitt($G58,$H58,$L58,P$9,P$10))","v":0},{"$f":"IF(ISNA($H58),0,zeitausschnitt($G58,$H58,$L58,Q$9,Q$10))","v":0},0,0,0,{"v":7.733333110809326,"d":"8"},8,{"v":3.7333333492279053,"d":"4"},0,0,0,0,0,0,0,0,0,0,0,0,0]
[{"$f":"A58","v":14000},{"$f":"B58","v":14100},{"$f":"C58+1","v":14102},null,"Entwicklung",{"$f":"OFFSET(F59,-3,0)&\" \"&OFFSET(F59,-2,0)&\" \"&INDIRECT(OFFSET(F59,-3,0)&\"!A5\")","v":"Projekt_3 Studie Entwicklung"},{"$f":"G58","v":"2013-09-01"},{"$f":"H58","v":"2013-11-15"},{"$f":"\"Aus Top Down \"&OFFSET(I59,-3,-3)","v":"Aus Top Down Projekt_3"},{"$f":"IF(ISNA(H59),0,1)","v":{"v":1,"d":"1.000"}},{"$f":"INDIRECT(\"'\"&OFFSET(K59,-3,-5)&\"'!B5\")","v":{"v":40,"d":"40.0"}},{"v":40,"d":"40.0"},{"$nulls":3},{"$f":"IF(ISNA($H59),0,zeitausschnitt($G59,$H59,$L59,P$9,P$10))","v":0},0,0,0,0,{"v":15.466666221618652,"d":"15"},16,{"v":7.4666666984558105,"d":"7"},0,0,0,0,0,0,0,0,0,0,0,0,0]
[14000,{"$f":"B59","v":14100},{"$f":"C59+1","v":14103},null,"Test",{"$f":"OFFSET(F60,-4,0)&\" \"&OFFSET(F60,-3,0)&\" \"&INDIRECT(OFFSET(F60,-4,0)&\"!A6\")","v":"Projekt_3 Studie Test"},{"$f":"G59","v":"2013-09-01"},{"$f":"H59","v":"2013-11-15"},{"$f":"\"Aus Top Down \"&OFFSET(I60,-4,-3)","v":"Aus Top Down Projekt_3"},{"$f":"IF(ISNA(H60),0,1)","v":{"v":1,"d":"1.000"}},{"$f":"INDIRECT(\"'\"&OFFSET(K60,-4,-5)&\"'!B6\")","v":{"v":30,"d":"30.0"}},{"v":30,"d":"30.0"},{"$nulls":3},0,0,0,0,0,{"v":11.600000381469727,"d":"12"},12,{"v":5.599999904632568,"d":"6"},0,0,0,0,0,0,0,0,0,0,0,0,0]
[14000,{"$nulls":10},""]
[14000,{"$f":"B57+100","v":14200},{"$nulls":3},{"$f":"INDIRECT(OFFSET(F62,-6,0)&\"!C1\")","v":"Konzept "},{"$f":"MIN(G63:G65)","v":"2013-11-15"},{"$f":"MAX(H63:H65)","v":"2014-01-29"},{"$nulls":3},"",{"$f":"SUMIF(B$12:B$519,B62,L$12:L$519)","v":{"v":90,"d":"90.0"}}]
[14000,{"$f":"B62","v":14200},{"$f":"B62+1","v":14201},null,"PL",{"$f":"OFFSET(F63,-7,0)&\" \"&OFFSET(F63,-1,0)&\" \"&INDIRECT(OFFSET(F63,-7,0)&\"!A4\")","v":"Projekt_3 Konzept  Projektleitung"},{"$f":"VLOOKUP(OFFSET(G63,-7,-1),Projektübersicht,4,0)","v":"2013-11-15"},{"$f":"VLOOKUP(OFFSET(H63,-7,-2),Projektübersicht,5,0)","v":"2014-01-29"},{"$f":"\"Aus Top Down \"&OFFSET(I63,-7,-3)","v":"Aus Top Down Projekt_3"},{"$f":"IF(ISNA(H63),0,1)","v":{"v":1,"d":"1.000"}},{"$f":"INDIRECT(\"'\"&OFFSET(K63,-7,-5)&\"'!C4\")","v":{"v":20,"d":"20.0"}},{"v":20,"d":"20.0"},{"$nulls":3},{"$f":"IF(ISNA($H63),0,zeitausschnitt($G63,$H63,$L63,P$9,P$10))","v":0},{"$f":"IF(ISNA($H63),0,zeitausschnitt($G63,$H63,$L63,Q$9,Q$10))","v":0},0,0,0,0,0,4,8,{"v":7.4666666984558105,"d":"7"},0,0,0,0,0,0,0,0,0,0,0]
[14000,{"$f":"B63","v":14200},{"$f":"C63+1","v":14202},null,"Entwicklung",{"$f":"OFFSET(F64,-8,0)&\" \"&OFFSET(F64,-2,0)&\" \"&INDIRECT(OFFSET(F64,-8,0)&\"!A5\")","v":"Projekt_3 Konzept  Entwicklung"},{"$f":"G63","v":"2013-11-15"},{"$f":"H63","v":"2014-01-29"},{"$f":"\"Aus Top Down \"&OFFSET(I64,-8,-3)","v":"Aus Top Down Projekt_3"},{"$f":"IF(ISNA(H64),0,1)","v":{"v":1,"d":"1.000"}},{"$f":"INDIRECT(\"'\"&OFFSET(K64,-8,-5)&\"'!C5\")","v":{"v":40,"d":"40.0"}},{"v":40,"d":"40.0"},{"$nulls":3},{"$f":"IF(ISNA($H64),0,zeitausschnitt($G64,$H64,$L64,P$9,P$10))","v":0},0,0,0,0,0,0,8,16,{"v":14.933333396911621,"d":"15"},0,0,0,0,0,0,0,0,0,0,0]
[14000,{"$f":"B64","v":14200},{"$f":"C64+1","v":14203},null,"Test",{"$f":"OFFSET(F65,-9,0)&\" \"&OFFSET(F65,-3,0)&\" \"&INDIRECT(OFFSET(F65,-9,0)&\"!A6\")","v":"Projekt_3 Konzept  Test"},{"$f":"G64","v":"2013-11-15"},{"$f":"H64","v":"2014-01-29"},{"$f":"\"Aus Top Down \"&OFFSET(I65,-9,-3)","v":"Aus Top Down Projekt_3"},{"$f":"IF(ISNA(H65),0,1)","v":{"v":1,"d":"1.000"}},{"$f":"INDIRECT(\"'\"&OFFSET(K65,-9,-5)&\"'!C6\")","v":{"v":30,"d":"30.0"}},{"v":30,"d":"30.0"},{"$nulls":3},0,0,0,0,0,0,0,6,12,{"v":11.199999809265137,"d":"11"},0,0,0,0,0,0,0,0,0,0,0]
[14000,{"$nulls":10},""]
[14000,{"$f":"B62+100","v":14300},{"$nulls":3},{"$f":"INDIRECT(OFFSET(F67,-11,0)&\"!D1\")","v":"Entwicklung"},{"$f":"MIN(G68:G70)","v":"2014-01-29"},{"$f":"MAX(H68:H70)","v":"2014-04-14"},{"$nulls":3},"",{"$f":"SUMIF(B$12:B$519,B67,L$12:L$519)","v":{"v":90,"d":"90.0"}}]
[14000,{"$f":"B67","v":14300},{"$f":"B67+1","v":14301},null,"PL",{"$f":"OFFSET(F68,-12,0)&\" \"&OFFSET(F68,-1,0)&\" \"&INDIRECT(OFFSET(F68,-12,0)&\"!A4\")","v":"Projekt_3 Entwicklung Projektleitung"},{"$f":"VLOOKUP(OFFSET(G68,-12,-1),Projektübersicht,5,0)","v":"2014-01-29"},{"$f":"VLOOKUP(OFFSET(H68,-12,-2),Projektübersicht,6,0)","v":"2014-04-14"},{"$f":"\"Aus Top Down \"&OFFSET(I68,-12,-3)","v":"Aus Top Down Projekt_3"},{"$f":"IF(ISNA(H68),0,1)","v":{"v":1,"d":"1.000"}},{"$f":"INDIRECT(\"'\"&OFFSET(K68,-12,-5)&\"'!D4\")","v":{"v":20,"d":"20.0"}},{"v":20,"d":"20.0"},{"$nulls":3},{"$f":"IF(ISNA($H68),0,zeitausschnitt($G68,$H68,$L68,P$9,P$10))","v":0},{"$f":"IF(ISNA($H68),0,zeitausschnitt($G68,$H68,$L68,Q$9,Q$10))","v":0},0,0,0,0,0,0,0,{"v":0.5333333611488342,"d":"1"},{"v":7.199999809265137,"d":"7"},8,{"v":3.4666666984558105,"d":"3"},0,0,0,0,0,0,0,0]
[14000,{"$f":"B68","v":14300},{"$f":"C68+1","v":14302},null,"Entwicklung",{"$f":"OFFSET(F69,-13,0)&\" \"&OFFSET(F69,-2,0)&\" \"&INDIRECT(OFFSET(F69,-13,0)&\"!A5\")","v":"Projekt_3 Entwicklung Entwicklung"},{"$f":"G68","v":"2014-01-29"},{"$f":"H68","v":"2014-04-14"},{"$f":"\"Aus Top Down \"&OFFSET(I69,-13,-3)","v":"Aus Top Down Projekt_3"},{"$f":"IF(ISNA(H69),0,1)","v":{"v":1,"d":"1.000"}},{"$f":"INDIRECT(\"'\"&OFFSET(K69,-13,-5)&\"'!D5\")","v":{"v":40,"d":"40.0"}},{"v":40,"d":"40.0"},{"$nulls":3},{"$f":"IF(ISNA($H69),0,zeitausschnitt($G69,$H69,$L69,P$9,P$10))","v":0},0,0,0,0,0,0,0,0,{"v":1.0666667222976685,"d":"1"},{"v":14.399999618530273,"d":"14"},16,{"v":6.933333396911621,"d":"7"},0,0,0,0,0,0,0,0]
[14000,{"$f":"B69","v":14300},{"$f":"C69+1","v":14303},null,"Test",{"$f":"OFFSET(F70,-14,0)&\" \"&OFFSET(F70,-3,0)&\" \"&INDIRECT(OFFSET(F70,-14,0)&\"!A6\")","v":"Projekt_3 Entwicklung Test"},{"$f":"G69","v":"2014-01-29"},{"$f":"H69","v":"2014-04-14"},{"$f":"\"Aus Top Down \"&OFFSET(I70,-14,-3)","v":"Aus Top Down Projekt_3"},{"$f":"IF(ISNA(H70),0,1)","v":{"v":1,"d":"1.000"}},{"$f":"INDIRECT(\"'\"&OFFSET(K70,-14,-5)&\"'!D6\")","v":{"v":30,"d":"30.0"}},{"v":30,"d":"30.0"},{"$nulls":3},0,0,0,0,0,0,0,0,0,{"v":0.800000011920929,"d":"1"},{"v":10.800000190734863,"d":"11"},12,{"v":5.199999809265137,"d":"5"},0,0,0,0,0,0,0,0]
[14000,{"$nulls":10},""]
[14000,{"$f":"B67+100","v":14400},{"$nulls":3},{"$f":"INDIRECT(OFFSET(F72,-16,0)&\"!E1\")","v":"Pflege"},{"$f":"MIN(G73:G75)","v":"2014-04-14"},{"$f":"MAX(H73:H75)","v":"2014-06-28"},{"$nulls":3},"",{"$f":"SUMIF(B$12:B$519,B72,L$12:L$519)","v":{"v":90,"d":"90.0"}}]
[14000,{"$f":"B72","v":14400},{"$f":"B72+1","v":14401},null,"PL",{"$f":"OFFSET(F73,-17,0)&\" \"&OFFSET(F73,-1,0)&\" \"&INDIRECT(OFFSET(F73,-17,0)&\"!A4\")","v":"Projekt_3 Pflege Projektleitung"},{"$f":"VLOOKUP(OFFSET(G73,-17,-1),Projektübersicht,6,0)","v":"2014-04-14"},{"$f":"VLOOKUP(OFFSET(H73,-17,-2),Projektübersicht,7,0)","v":"2014-06-28"},{"$f":"\"Aus Top Down \"&OFFSET(I73,-17,-3)","v":"Aus Top Down Projekt_3"},{"$f":"IF(ISNA(H73),0,1)","v":{"v":1,"d":"1.000"}},{"$f":"INDIRECT(\"'\"&OFFSET(K73,-17,-5)&\"'!E4\")","v":{"v":20,"d":"20.0"}},{"v":20,"d":"20.0"},{"$nulls":3},{"$f":"IF(ISNA($H73),0,zeitausschnitt($G73,$H73,$L73,P$9,P$10))","v":0},{"$f":"IF(ISNA($H73),0,zeitausschnitt($G73,$H73,$L73,Q$9,Q$10))","v":0},0,0,0,0,0,0,0,0,0,0,{"v":4.266666889190674,"d":"4"},8,{"v":7.199999809265137,"d":"7"},0,0,0,0,0,0]
[14000,{"$f":"B73","v":14400},{"$f":"C73+1","v":14402},null,"Entwicklung",{"$f":"OFFSET(F74,-18,0)&\" \"&OFFSET(F74,-2,0)&\" \"&INDIRECT(OFFSET(F74,-18,0)&\"!A5\")","v":"Projekt_3 Pflege Entwicklung"},{"$f":"G73","v":"2014-04-14"},{"$f":"H73","v":"2014-06-28"},{"$f":"\"Aus Top Down \"&OFFSET(I74,-18,-3)","v":"Aus Top Down Projekt_3"},{"$f":"IF(ISNA(H74),0,1)","v":{"v":1,"d":"1.000"}},{"$f":"INDIRECT(\"'\"&OFFSET(K74,-18,-5)&\"'!E5\")","v":{"v":40,"d":"40.0"}},{"v":40,"d":"40.0"},{"$nulls":3},{"$f":"IF(ISNA($H74),0,zeitausschnitt($G74,$H74,$L74,P$9,P$10))","v":0},0,0,0,0,0,0,0,0,0,0,0,{"v":8.533333778381348,"d":"9"},16,{"v":14.399999618530273,"d":"14"},0,0,0,0,0,0]
[14000,{"$f":"B74","v":14400},{"$f":"C74+1","v":14403},null,"Test",{"$f":"OFFSET(F75,-19,0)&\" \"&OFFSET(F75,-3,0)&\" \"&INDIRECT(OFFSET(F75,-19,0)&\"!A6\")","v":"Projekt_3 Pflege Test"},{"$f":"G74","v":"2014-04-14"},{"$f":"H74","v":"2014-06-28"},{"$f":"\"Aus Top Down \"&OFFSET(I75,-19,-3)","v":"Aus Top Down Projekt_3"},{"$f":"IF(ISNA(H75),0,1)","v":{"v":1,"d":"1.000"}},{"$f":"INDIRECT(\"'\"&OFFSET(K75,-19,-5)&\"'!E6\")","v":{"v":30,"d":"30.0"}},{"v":30,"d":"30.0"},{"$nulls":3},0,0,0,0,0,0,0,0,0,0,0,0,{"v":6.400000095367432,"d":"6"},12,{"v":10.800000190734863,"d":"11"},0,0,0,0,0,0]
[14000,{"$nulls":10},{"$f":"IF(AND(J76<>\"\",K76<>\"\"),J76*K76,\"\")","v":""}]
[{"$nulls":11},""]
[{"$f":"A56+1000","v":15000},{"$nulls":4},{"$f":"INDIRECT(CONCATENATE(\"Übersicht!C\",TEXT((A78-10000)/1000,0)))","v":"Projekt_4"},{"$f":"MIN(G79:G93)","v":{"$error":"#N/A"}},{"$f":"MAX(H79:H93)","v":{"$error":"#N/A"}},{"$nulls":3},"",{"$f":"SUMIF(A$12:A$519,A78,L$12:L$519)","v":{"v":0,"d":"0.0"}},null,{"$f":"F78","v":"Projekt_4"},{"$f":"SUM(P80:P97)","v":0},{"$f":"SUM(Q80:Q97)","v":0},0,0,0,0,0,0,0,0,0,0,0,0,0,0,0,0,0,0,0]
[{"$f":"A78","v":15000},{"$f":"A78+100","v":15100},{"$nulls":3},{"$f":"INDIRECT(OFFSET(F79,-1,0)&\"!B1\")","v":"Studie"},{"$f":"MIN(G80:G82)","v":"2013-10-01"},{"$f":"MAX(H80:H82)","v":{"$error":"#N/A"}},{"$nulls":3},"",{"$f":"SUMIF(B$12:B$519,B79,L$12:L$519)","v":{"v":0,"d":"0.0"}}]
[{"$f":"A79","v":15000},{"$f":"B79","v":15100},{"$f":"B79+1","v":15101},null,"PL",{"$f":"OFFSET(F80,-2,0)&\" \"&OFFSET(F80,-1,0)&\" \"&INDIRECT(OFFSET(F80,-2,0)&\"!A4\")","v":"Projekt_4 Studie Projektleitung"},{"$f":"VLOOKUP(OFFSET(G80,-2,-1),Projektübersicht,3,0)","v":"2013-10-01"},{"$f":"VLOOKUP(OFFSET(H80,-2,-2),Projektübersicht,4,0)","v":{"$error":"#N/A"}},{"$f":"\"Aus Top Down \"&OFFSET(I80,-2,-3)","v":"Aus Top Down Projekt_4"},{"$f":"IF(ISNA(H80),0,1)","v":{"v":0,"d":"0.000"}},{"$f":"INDIRECT(\"'\"&OFFSET(K80,-2,-5)&\"'!B4\")","v":{"v":20,"d":"20.0"}},{"v":0,"d":"0.0"},{"$nulls":3},{"$f":"IF(ISNA($H80),0,zeitausschnitt($G80,$H80,$L80,P$9,P$10))","v":0},{"$f":"IF(ISNA($H80),0,zeitausschnitt($G80,$H80,$L80,Q$9,Q$10))","v":0},0,0,0,0,0,0,0,0,0,0,0,0,0,0,0,0,0,0,0]
[{"$f":"A80","v":15000},{"$f":"B80","v":15100},{"$f":"C80+1","v":15102},null,"Entwicklung",{"$f":"OFFSET(F81,-3,0)&\" \"&OFFSET(F81,-2,0)&\" \"&INDIRECT(OFFSET(F81,-3,0)&\"!A5\")","v":"Projekt_4 Studie Entwicklung"},{"$f":"G80","v":"2013-10-01"},{"$f":"H80","v":{"$error":"#N/A"}},{"$f":"\"Aus Top Down \"&OFFSET(I81,-3,-3)","v":"Aus Top Down Projekt_4"},{"$f":"IF(ISNA(H81),0,1)","v":{"v":0,"d":"0.000"}},{"$f":"INDIRECT(\"'\"&OFFSET(K81,-3,-5)&\"'!B5\")","v":{"v":40,"d":"40.0"}},{"v":0,"d":"0.0"},{"$nulls":3},{"$f":"IF(ISNA($H81),0,zeitausschnitt($G81,$H81,$L81,P$9,P$10))","v":0},0,0,0,0,0,0,0,0,0,0,0,0,0,0,0,0,0,0,0,0]
[15000,{"$f":"B81","v":15100},{"$f":"C81+1","v":15103},null,"Test",{"$f":"OFFSET(F82,-4,0)&\" \"&OFFSET(F82,-3,0)&\" \"&INDIRECT(OFFSET(F82,-4,0)&\"!A6\")","v":"Projekt_4 Studie Test"},{"$f":"G81","v":"2013-10-01"},{"$f":"H81","v":{"$error":"#N/A"}},{"$f":"\"Aus Top Down \"&OFFSET(I82,-4,-3)","v":"Aus Top Down Projekt_4"},{"$f":"IF(ISNA(H82),0,1)","v":{"v":0,"d":"0.000"}},{"$f":"INDIRECT(\"'\"&OFFSET(K82,-4,-5)&\"'!B6\")","v":{"v":30,"d":"30.0"}},{"v":0,"d":"0.0"},{"$nulls":3},0,0,0,0,0,0,0,0,0,0,0,0,0,0,0,0,0,0,0,0,0]
[15000,{"$nulls":10},""]
[15000,{"$f":"B79+100","v":15200},{"$nulls":3},{"$f":"INDIRECT(OFFSET(F84,-6,0)&\"!C1\")","v":"Konzept "},{"$f":"MIN(G85:G87)","v":{"$error":"#N/A"}},{"$f":"MAX(H85:H87)","v":{"$error":"#N/A"}},{"$nulls":3},"",{"$f":"SUMIF(B$12:B$519,B84,L$12:L$519)","v":{"v":0,"d":"0.0"}}]
[15000,{"$f":"B84","v":15200},{"$f":"B84+1","v":15201},null,"PL",{"$f":"OFFSET(F85,-7,0)&\" \"&OFFSET(F85,-1,0)&\" \"&INDIRECT(OFFSET(F85,-7,0)&\"!A4\")","v":"Projekt_4 Konzept  Projektleitung"},{"$f":"VLOOKUP(OFFSET(G85,-7,-1),Projektübersicht,4,0)","v":{"$error":"#N/A"}},{"$f":"VLOOKUP(OFFSET(H85,-7,-2),Projektübersicht,5,0)","v":{"$error":"#N/A"}},{"$f":"\"Aus Top Down \"&OFFSET(I85,-7,-3)","v":"Aus Top Down Projekt_4"},{"$f":"IF(ISNA(H85),0,1)","v":{"v":0,"d":"0.000"}},{"$f":"INDIRECT(\"'\"&OFFSET(K85,-7,-5)&\"'!C4\")","v":{"v":20,"d":"20.0"}},{"v":0,"d":"0.0"},{"$nulls":3},{"$f":"IF(ISNA($H85),0,zeitausschnitt($G85,$H85,$L85,P$9,P$10))","v":0},{"$f":"IF(ISNA($H85),0,zeitausschnitt($G85,$H85,$L85,Q$9,Q$10))","v":0},0,0,0,0,0,0,0,0,0,0,0,0,0,0,0,0,0,0,0]
[15000,{"$f":"B85","v":15200},{"$f":"C85+1","v":15202},null,"Entwicklung",{"$f":"OFFSET(F86,-8,0)&\" \"&OFFSET(F86,-2,0)&\" \"&INDIRECT(OFFSET(F86,-8,0)&\"!A5\")","v":"Projekt_4 Konzept  Entwicklung"},{"$f":"G85","v":{"$error":"#N/A"}},{"$f":"H85","v":{"$error":"#N/A"}},{"$f":"\"Aus Top Down \"&OFFSET(I86,-8,-3)","v":"Aus Top Down Projekt_4"},{"$f":"IF(ISNA(H86),0,1)","v":{"v":0,"d":"0.000"}},{"$f":"INDIRECT(\"'\"&OFFSET(K86,-8,-5)&\"'!C5\")","v":{"v":40,"d":"40.0"}},{"v":0,"d":"0.0"},{"$nulls":3},{"$f":"IF(ISNA($H86),0,zeitausschnitt($G86,$H86,$L86,P$9,P$10))","v":0},0,0,0,0,0,0,0,0,0,0,0,0,0,0,0,0,0,0,0,0]
[15000,{"$f":"B86","v":15200},{"$f":"C86+1","v":15203},null,"Test",{"$f":"OFFSET(F87,-9,0)&\" \"&OFFSET(F87,-3,0)&\" \"&INDIRECT(OFFSET(F87,-9,0)&\"!A6\")","v":"Projekt_4 Konzept  Test"},{"$f":"G86","v":{"$error":"#N/A"}},{"$f":"H86","v":{"$error":"#N/A"}},{"$f":"\"Aus Top Down \"&OFFSET(I87,-9,-3)","v":"Aus Top Down Projekt_4"},{"$f":"IF(ISNA(H87),0,1)","v":{"v":0,"d":"0.000"}},{"$f":"INDIRECT(\"'\"&OFFSET(K87,-9,-5)&\"'!C6\")","v":{"v":30,"d":"30.0"}},{"v":0,"d":"0.0"},{"$nulls":3},0,0,0,0,0,0,0,0,0,0,0,0,0,0,0,0,0,0,0,0,0]
[15000,{"$nulls":10},""]
[15000,{"$f":"B84+100","v":15300},{"$nulls":3},{"$f":"INDIRECT(OFFSET(F89,-11,0)&\"!D1\")","v":"Entwicklung"},{"$f":"MIN(G90:G92)","v":{"$error":"#N/A"}},{"$f":"MAX(H90:H92)","v":{"$error":"#N/A"}},{"$nulls":3},"",{"$f":"SUMIF(B$12:B$519,B89,L$12:L$519)","v":{"v":0,"d":"0.0"}}]
[15000,{"$f":"B89","v":15300},{"$f":"B89+1","v":15301},null,"PL",{"$f":"OFFSET(F90,-12,0)&\" \"&OFFSET(F90,-1,0)&\" \"&INDIRECT(OFFSET(F90,-12,0)&\"!A4\")","v":"Projekt_4 Entwicklung Projektleitung"},{"$f":"VLOOKUP(OFFSET(G90,-12,-1),Projektübersicht,5,0)","v":{"$error":"#N/A"}},{"$f":"VLOOKUP(OFFSET(H90,-12,-2),Projektübersicht,6,0)","v":{"$error":"#N/A"}},{"$f":"\"Aus Top Down \"&OFFSET(I90,-12,-3)","v":"Aus Top Down Projekt_4"},{"$f":"IF(ISNA(H90),0,1)","v":{"v":0,"d":"0.000"}},{"$f":"INDIRECT(\"'\"&OFFSET(K90,-12,-5)&\"'!D4\")","v":{"v":20,"d":"20.0"}},{"v":0,"d":"0.0"},{"$nulls":3},{"$f":"IF(ISNA($H90),0,zeitausschnitt($G90,$H90,$L90,P$9,P$10))","v":0},{"$f":"IF(ISNA($H90),0,zeitausschnitt($G90,$H90,$L90,Q$9,Q$10))","v":0},0,0,0,0,0,0,0,0,0,0,0,0,0,0,0,0,0,0,0]
[15000,{"$f":"B90","v":15300},{"$f":"C90+1","v":15302},null,"Entwicklung",{"$f":"OFFSET(F91,-13,0)&\" \"&OFFSET(F91,-2,0)&\" \"&INDIRECT(OFFSET(F91,-13,0)&\"!A5\")","v":"Projekt_4 Entwicklung Entwicklung"},{"$f":"G90","v":{"$error":"#N/A"}},{"$f":"H90","v":{"$error":"#N/A"}},{"$f":"\"Aus Top Down \"&OFFSET(I91,-13,-3)","v":"Aus Top Down Projekt_4"},{"$f":"IF(ISNA(H91),0,1)","v":{"v":0,"d":"0.000"}},{"$f":"INDIRECT(\"'\"&OFFSET(K91,-13,-5)&\"'!D5\")","v":{"v":40,"d":"40.0"}},{"v":0,"d":"0.0"},{"$nulls":3},{"$f":"IF(ISNA($H91),0,zeitausschnitt($G91,$H91,$L91,P$9,P$10))","v":0},0,0,0,0,0,0,0,0,0,0,0,0,0,0,0,0,0,0,0,0]
[15000,{"$f":"B91","v":15300},{"$f":"C91+1","v":15303},null,"Test",{"$f":"OFFSET(F92,-14,0)&\" \"&OFFSET(F92,-3,0)&\" \"&INDIRECT(OFFSET(F92,-14,0)&\"!A6\")","v":"Projekt_4 Entwicklung Test"},{"$f":"G91","v":{"$error":"#N/A"}},{"$f":"H91","v":{"$error":"#N/A"}},{"$f":"\"Aus Top Down \"&OFFSET(I92,-14,-3)","v":"Aus Top Down Projekt_4"},{"$f":"IF(ISNA(H92),0,1)","v":{"v":0,"d":"0.000"}},{"$f":"INDIRECT(\"'\"&OFFSET(K92,-14,-5)&\"'!D6\")","v":{"v":30,"d":"30.0"}},{"v":0,"d":"0.0"},{"$nulls":3},0,0,0,0,0,0,0,0,0,0,0,0,0,0,0,0,0,0,0,0,0]
[15000,{"$nulls":10},""]
[15000,{"$f":"B89+100","v":15400},{"$nulls":3},{"$f":"INDIRECT(OFFSET(F94,-16,0)&\"!E1\")","v":"Pflege"},{"$f":"MIN(G95:G97)","v":{"$error":"#N/A"}},{"$f":"MAX(H95:H97)","v":{"$error":"#N/A"}},{"$nulls":3},"",{"$f":"SUMIF(B$12:B$519,B94,L$12:L$519)","v":{"v":0,"d":"0.0"}}]
[15000,{"$f":"B94","v":15400},{"$f":"B94+1","v":15401},null,"PL",{"$f":"OFFSET(F95,-17,0)&\" \"&OFFSET(F95,-1,0)&\" \"&INDIRECT(OFFSET(F95,-17,0)&\"!A4\")","v":"Projekt_4 Pflege Projektleitung"},{"$f":"VLOOKUP(OFFSET(G95,-17,-1),Projektübersicht,6,0)","v":{"$error":"#N/A"}},{"$f":"VLOOKUP(OFFSET(H95,-17,-2),Projektübersicht,7,0)","v":{"$error":"#N/A"}},{"$f":"\"Aus Top Down \"&OFFSET(I95,-17,-3)","v":"Aus Top Down Projekt_4"},{"$f":"IF(ISNA(H95),0,1)","v":{"v":0,"d":"0.000"}},{"$f":"INDIRECT(\"'\"&OFFSET(K95,-17,-5)&\"'!E4\")","v":{"v":20,"d":"20.0"}},{"v":0,"d":"0.0"},{"$nulls":3},{"$f":"IF(ISNA($H95),0,zeitausschnitt($G95,$H95,$L95,P$9,P$10))","v":0},{"$f":"IF(ISNA($H95),0,zeitausschnitt($G95,$H95,$L95,Q$9,Q$10))","v":0},0,0,0,0,0,0,0,0,0,0,0,0,0,0,0,0,0,0,0]
[15000,{"$f":"B95","v":15400},{"$f":"C95+1","v":15402},null,"Entwicklung",{"$f":"OFFSET(F96,-18,0)&\" \"&OFFSET(F96,-2,0)&\" \"&INDIRECT(OFFSET(F96,-18,0)&\"!A5\")","v":"Projekt_4 Pflege Entwicklung"},{"$f":"G95","v":{"$error":"#N/A"}},{"$f":"H95","v":{"$error":"#N/A"}},{"$f":"\"Aus Top Down \"&OFFSET(I96,-18,-3)","v":"Aus Top Down Projekt_4"},{"$f":"IF(ISNA(H96),0,1)","v":{"v":0,"d":"0.000"}},{"$f":"INDIRECT(\"'\"&OFFSET(K96,-18,-5)&\"'!E5\")","v":{"v":40,"d":"40.0"}},{"v":0,"d":"0.0"},{"$nulls":3},{"$f":"IF(ISNA($H96),0,zeitausschnitt($G96,$H96,$L96,P$9,P$10))","v":0},0,0,0,0,0,0,0,0,0,0,0,0,0,0,0,0,0,0,0,0]
[15000,{"$f":"B96","v":15400},{"$f":"C96+1","v":15403},null,"Test",{"$f":"OFFSET(F97,-19,0)&\" \"&OFFSET(F97,-3,0)&\" \"&INDIRECT(OFFSET(F97,-19,0)&\"!A6\")","v":"Projekt_4 Pflege Test"},{"$f":"G96","v":{"$error":"#N/A"}},{"$f":"H96","v":{"$error":"#N/A"}},{"$f":"\"Aus Top Down \"&OFFSET(I97,-19,-3)","v":"Aus Top Down Projekt_4"},{"$f":"IF(ISNA(H97),0,1)","v":{"v":0,"d":"0.000"}},{"$f":"INDIRECT(\"'\"&OFFSET(K97,-19,-5)&\"'!E6\")","v":{"v":30,"d":"30.0"}},{"v":0,"d":"0.0"},{"$nulls":3},0,0,0,0,0,0,0,0,0,0,0,0,0,0,0,0,0,0,0,0,0]
[15000,{"$nulls":10},""]
[{"$nulls":11},{"$f":"IF(AND(J99<>\"\",K99<>\"\"),J99*K99,\"\")","v":""}]
[{"$f":"A78+1000","v":16000},{"$nulls":4},{"$f":"INDIRECT(CONCATENATE(\"Übersicht!C\",TEXT((A100-10000)/1000,0)))","v":"Leer"},{"$f":"MIN(G101:G115)","v":{"$error":"#N/A"}},{"$f":"MAX(H101:H115)","v":{"$error":"#N/A"}},{"$nulls":3},"",{"$f":"SUMIF(A$12:A$519,A100,L$12:L$519)","v":{"v":0,"d":"0.0"}},null,{"$f":"F100","v":"Leer"},{"$f":"SUM(P102:P119)","v":0},{"$f":"SUM(Q102:Q119)","v":0},0,0,0,0,0,0,0,0,0,0,0,0,0,0,0,0,0,0,0]
[{"$f":"A100","v":16000},{"$f":"A100+100","v":16100},{"$nulls":3},{"$f":"INDIRECT(OFFSET(F101,-1,0)&\"!B1\")","v":"Studie"},{"$f":"MIN(G102:G104)","v":"00:00:00"},{"$f":"MAX(H102:H104)","v":{"$error":"#N/A"}},{"$nulls":3},"",{"$f":"SUMIF(B$12:B$519,B101,L$12:L$519)","v":{"v":0,"d":"0.0"}}]
[{"$f":"A101","v":16000},{"$f":"B101","v":16100},{"$f":"B101+1","v":16101},null,"PL",{"$f":"OFFSET(F102,-2,0)&\" \"&OFFSET(F102,-1,0)&\" \"&INDIRECT(OFFSET(F102,-2,0)&\"!A4\")","v":"Leer Studie Projektleitung"},{"$f":"VLOOKUP(OFFSET(G102,-2,-1),Projektübersicht,3,0)","v":"00:00:00"},{"$f":"VLOOKUP(OFFSET(H102,-2,-2),Projektübersicht,4,0)","v":{"$error":"#N/A"}},{"$f":"\"Aus Top Down \"&OFFSET(I102,-2,-3)","v":"Aus Top Down Leer"},{"$f":"IF(ISNA(H102),0,1)","v":{"v":0,"d":"0.000"}},{"$f":"INDIRECT(\"'\"&OFFSET(K102,-2,-5)&\"'!B4\")","v":{"v":0,"d":"0.0"}},{"v":0,"d":"0.0"},{"$nulls":3},{"$f":"IF(ISNA($H102),0,zeitausschnitt($G102,$H102,$L102,P$9,P$10))","v":0},{"$f":"IF(ISNA($H102),0,zeitausschnitt($G102,$H102,$L102,Q$9,Q$10))","v":0},0,0,0,0,0,0,0,0,0,0,0,0,0,0,0,0,0,0,0]
[{"$f":"A102","v":16000},{"$f":"B102","v":16100},{"$f":"C102+1","v":16102},null,"Entwicklung",{"$f":"OFFSET(F103,-3,0)&\" \"&OFFSET(F103,-2,0)&\" \"&INDIRECT(OFFSET(F103,-3,0)&\"!A5\")","v":"Leer Studie Entwicklung"},{"$f":"G102","v":"00:00:00"},{"$f":"H102","v":{"$error":"#N/A"}},{"$f":"\"Aus Top Down \"&OFFSET(I103,-3,-3)","v":"Aus Top Down Leer"},{"$f":"IF(ISNA(H103),0,1)","v":{"v":0,"d":"0.000"}},{"$f":"INDIRECT(\"'\"&OFFSET(K103,-3,-5)&\"'!B5\")","v":{"v":0,"d":"0.0"}},{"v":0,"d":"0.0"},{"$nulls":3},{"$f":"IF(ISNA($H103),0,zeitausschnitt($G103,$H103,$L103,P$9,P$10))","v":0},0,0,0,0,0,0,0,0,0,0,0,0,0,0,0,0,0,0,0,0]
[16000,{"$f":"B103","v":16100},{"$f":"C103+1","v":16103},null,"Test",{"$f":"OFFSET(F104,-4,0)&\" \"&OFFSET(F104,-3,0)&\" \"&INDIRECT(OFFSET(F104,-4,0)&\"!A6\")","v":"Leer Studie Test"},{"$f":"G103","v":"00:00:00"},{"$f":"H103","v":{"$error":"#N/A"}},{"$f":"\"Aus Top Down \"&OFFSET(I104,-4,-3)","v":"Aus Top Down Leer"},{"$f":"IF(ISNA(H104),0,1)","v":{"v":0,"d":"0.000"}},{"$f":"INDIRECT(\"'\"&OFFSET(K104,-4,-5)&\"'!B6\")","v":{"v":0,"d":"0.0"}},{"v":0,"d":"0.0"},{"$nulls":3},0,0,0,0,0,0,0,0,0,0,0,0,0,0,0,0,0,0,0,0,0]
[16000,{"$nulls":10},""]
[16000,{"$f":"B101+100","v":16200},{"$nulls":3},{"$f":"INDIRECT(OFFSET(F106,-6,0)&\"!C1\")","v":"Konzept "},{"$f":"MIN(G107:G109)","v":{"$error":"#N/A"}},{"$f":"MAX(H107:H109)","v":{"$error":"#N/A"}},{"$nulls":3},"",{"$f":"SUMIF(B$12:B$519,B106,L$12:L$519)","v":{"v":0,"d":"0.0"}}]
[16000,{"$f":"B106","v":16200},{"$f":"B106+1","v":16201},null,"PL",{"$f":"OFFSET(F107,-7,0)&\" \"&OFFSET(F107,-1,0)&\" \"&INDIRECT(OFFSET(F107,-7,0)&\"!A4\")","v":"Leer Konzept  Projektleitung"},{"$f":"VLOOKUP(OFFSET(G107,-7,-1),Projektübersicht,4,0)","v":{"$error":"#N/A"}},{"$f":"VLOOKUP(OFFSET(H107,-7,-2),Projektübersicht,5,0)","v":{"$error":"#N/A"}},{"$f":"\"Aus Top Down \"&OFFSET(I107,-7,-3)","v":"Aus Top Down Leer"},{"$f":"IF(ISNA(H107),0,1)","v":{"v":0,"d":"0.000"}},{"$f":"INDIRECT(\"'\"&OFFSET(K107,-7,-5)&\"'!C4\")","v":{"v":0,"d":"0.0"}},{"v":0,"d":"0.0"},{"$nulls":3},{"$f":"IF(ISNA($H107),0,zeitausschnitt($G107,$H107,$L107,P$9,P$10))","v":0},{"$f":"IF(ISNA($H107),0,zeitausschnitt($G107,$H107,$L107,Q$9,Q$10))","v":0},0,0,0,0,0,0,0,0,0,0,0,0,0,0,0,0,0,0,0]
[16000,{"$f":"B107","v":16200},{"$f":"C107+1","v":16202},null,"Entwicklung",{"$f":"OFFSET(F108,-8,0)&\" \"&OFFSET(F108,-2,0)&\" \"&INDIRECT(OFFSET(F108,-8,0)&\"!A5\")","v":"Leer Konzept  Entwicklung"},{"$f":"G107","v":{"$error":"#N/A"}},{"$f":"H107","v":{"$error":"#N/A"}},{"$f":"\"Aus Top Down \"&OFFSET(I108,-8,-3)","v":"Aus Top Down Leer"},{"$f":"IF(ISNA(H108),0,1)","v":{"v":0,"d":"0.000"}},{"$f":"INDIRECT(\"'\"&OFFSET(K108,-8,-5)&\"'!C5\")","v":{"v":0,"d":"0.0"}},{"v":0,"d":"0.0"},{"$nulls":3},{"$f":"IF(ISNA($H108),0,zeitausschnitt($G108,$H108,$L108,P$9,P$10))","v":0},0,0,0,0,0,0,0,0,0,0,0,0,0,0,0,0,0,0,0,0]
[16000,{"$f":"B108","v":16200},{"$f":"C108+1","v":16203},null,"Test",{"$f":"OFFSET(F109,-9,0)&\" \"&OFFSET(F109,-3,0)&\" \"&INDIRECT(OFFSET(F109,-9,0)&\"!A6\")","v":"Leer Konzept  Test"},{"$f":"G108","v":{"$error":"#N/A"}},{"$f":"H108","v":{"$error":"#N/A"}},{"$f":"\"Aus Top Down \"&OFFSET(I109,-9,-3)","v":"Aus Top Down Leer"},{"$f":"IF(ISNA(H109),0,1)","v":{"v":0,"d":"0.000"}},{"$f":"INDIRECT(\"'\"&OFFSET(K109,-9,-5)&\"'!C6\")","v":{"v":0,"d":"0.0"}},{"v":0,"d":"0.0"},{"$nulls":3},0,0,0,0,0,0,0,0,0,0,0,0,0,0,0,0,0,0,0,0,0]
[16000,{"$nulls":10},""]
[16000,{"$f":"B106+100","v":16300},{"$nulls":3},{"$f":"INDIRECT(OFFSET(F111,-11,0)&\"!D1\")","v":"Entwicklung"},{"$f":"MIN(G112:G114)","v":{"$error":"#N/A"}},{"$f":"MAX(H112:H114)","v":{"$error":"#N/A"}},{"$nulls":3},"",{"$f":"SUMIF(B$12:B$519,B111,L$12:L$519)","v":{"v":0,"d":"0.0"}}]
[16000,{"$f":"B111","v":16300},{"$f":"B111+1","v":16301},null,"PL",{"$f":"OFFSET(F112,-12,0)&\" \"&OFFSET(F112,-1,0)&\" \"&INDIRECT(OFFSET(F112,-12,0)&\"!A4\")","v":"Leer Entwicklung Projektleitung"},{"$f":"VLOOKUP(OFFSET(G112,-12,-1),Projektübersicht,5,0)","v":{"$error":"#N/A"}},{"$f":"VLOOKUP(OFFSET(H112,-12,-2),Projektübersicht,6,0)","v":{"$error":"#N/A"}},{"$f":"\"Aus Top Down \"&OFFSET(I112,-12,-3)","v":"Aus Top Down Leer"},{"$f":"IF(ISNA(H112),0,1)","v":{"v":0,"d":"0.000"}},{"$f":"INDIRECT(\"'\"&OFFSET(K112,-12,-5)&\"'!D4\")","v":{"v":0,"d":"0.0"}},{"v":0,"d":"0.0"},{"$nulls":3},{"$f":"IF(ISNA($H112),0,zeitausschnitt($G112,$H112,$L112,P$9,P$10))","v":0},{"$f":"IF(ISNA($H112),0,zeitausschnitt($G112,$H112,$L112,Q$9,Q$10))","v":0},0,0,0,0,0,0,0,0,0,0,0,0,0,0,0,0,0,0,0]
[16000,{"$f":"B112","v":16300},{"$f":"C112+1","v":16302},null,"Entwicklung",{"$f":"OFFSET(F113,-13,0)&\" \"&OFFSET(F113,-2,0)&\" \"&INDIRECT(OFFSET(F113,-13,0)&\"!A5\")","v":"Leer Entwicklung Entwicklung"},{"$f":"G112","v":{"$error":"#N/A"}},{"$f":"H112","v":{"$error":"#N/A"}},{"$f":"\"Aus Top Down \"&OFFSET(I113,-13,-3)","v":"Aus Top Down Leer"},{"$f":"IF(ISNA(H113),0,1)","v":{"v":0,"d":"0.000"}},{"$f":"INDIRECT(\"'\"&OFFSET(K113,-13,-5)&\"'!D5\")","v":{"v":0,"d":"0.0"}},{"v":0,"d":"0.0"},{"$nulls":3},{"$f":"IF(ISNA($H113),0,zeitausschnitt($G113,$H113,$L113,P$9,P$10))","v":0},0,0,0,0,0,0,0,0,0,0,0,0,0,0,0,0,0,0,0,0]
[16000,{"$f":"B113","v":16300},{"$f":"C113+1","v":16303},null,"Test",{"$f":"OFFSET(F114,-14,0)&\" \"&OFFSET(F114,-3,0)&\" \"&INDIRECT(OFFSET(F114,-14,0)&\"!A6\")","v":"Leer Entwicklung Test"},{"$f":"G113","v":{"$error":"#N/A"}},{"$f":"H113","v":{"$error":"#N/A"}},{"$f":"\"Aus Top Down \"&OFFSET(I114,-14,-3)","v":"Aus Top Down Leer"},{"$f":"IF(ISNA(H114),0,1)","v":{"v":0,"d":"0.000"}},{"$f":"INDIRECT(\"'\"&OFFSET(K114,-14,-5)&\"'!D6\")","v":{"v":0,"d":"0.0"}},{"v":0,"d":"0.0"},{"$nulls":3},0,0,0,0,0,0,0,0,0,0,0,0,0,0,0,0,0,0,0,0,0]
[16000,{"$nulls":10},""]
[16000,{"$f":"B111+100","v":16400},{"$nulls":3},{"$f":"INDIRECT(OFFSET(F116,-16,0)&\"!E1\")","v":"Pflege"},{"$f":"MIN(G117:G119)","v":{"$error":"#N/A"}},{"$f":"MAX(H117:H119)","v":{"$error":"#N/A"}},{"$nulls":3},"",{"$f":"SUMIF(B$12:B$519,B116,L$12:L$519)","v":{"v":0,"d":"0.0"}}]
[16000,{"$f":"B116","v":16400},{"$f":"B116+1","v":16401},null,"PL",{"$f":"OFFSET(F117,-17,0)&\" \"&OFFSET(F117,-1,0)&\" \"&INDIRECT(OFFSET(F117,-17,0)&\"!A4\")","v":"Leer Pflege Projektleitung"},{"$f":"VLOOKUP(OFFSET(G117,-17,-1),Projektübersicht,6,0)","v":{"$error":"#N/A"}},{"$f":"VLOOKUP(OFFSET(H117,-17,-2),Projektübersicht,7,0)","v":{"$error":"#N/A"}},{"$f":"\"Aus Top Down \"&OFFSET(I117,-17,-3)","v":"Aus Top Down Leer"},{"$f":"IF(ISNA(H117),0,1)","v":{"v":0,"d":"0.000"}},{"$f":"INDIRECT(\"'\"&OFFSET(K117,-17,-5)&\"'!E4\")","v":{"v":0,"d":"0.0"}},{"v":0,"d":"0.0"},{"$nulls":3},{"$f":"IF(ISNA($H117),0,zeitausschnitt($G117,$H117,$L117,P$9,P$10))","v":0},{"$f":"IF(ISNA($H117),0,zeitausschnitt($G117,$H117,$L117,Q$9,Q$10))","v":0},0,0,0,0,0,0,0,0,0,0,0,0,0,0,0,0,0,0,0]
[16000,{"$f":"B117","v":16400},{"$f":"C117+1","v":16402},null,"Entwicklung",{"$f":"OFFSET(F118,-18,0)&\" \"&OFFSET(F118,-2,0)&\" \"&INDIRECT(OFFSET(F118,-18,0)&\"!A5\")","v":"Leer Pflege Entwicklung"},{"$f":"G117","v":{"$error":"#N/A"}},{"$f":"H117","v":{"$error":"#N/A"}},{"$f":"\"Aus Top Down \"&OFFSET(I118,-18,-3)","v":"Aus Top Down Leer"},{"$f":"IF(ISNA(H118),0,1)","v":{"v":0,"d":"0.000"}},{"$f":"INDIRECT(\"'\"&OFFSET(K118,-18,-5)&\"'!E5\")","v":{"v":0,"d":"0.0"}},{"v":0,"d":"0.0"},{"$nulls":3},{"$f":"IF(ISNA($H118),0,zeitausschnitt($G118,$H118,$L118,P$9,P$10))","v":0},0,0,0,0,0,0,0,0,0,0,0,0,0,0,0,0,0,0,0,0]
[16000,{"$f":"B118","v":16400},{"$f":"C118+1","v":16403},null,"Test",{"$f":"OFFSET(F119,-19,0)&\" \"&OFFSET(F119,-3,0)&\" \"&INDIRECT(OFFSET(F119,-19,0)&\"!A6\")","v":"Leer Pflege Test"},{"$f":"G118","v":{"$error":"#N/A"}},{"$f":"H118","v":{"$error":"#N/A"}},{"$f":"\"Aus Top Down \"&OFFSET(I119,-19,-3)","v":"Aus Top Down Leer"},{"$f":"IF(ISNA(H119),0,1)","v":{"v":0,"d":"0.000"}},{"$f":"INDIRECT(\"'\"&OFFSET(K119,-19,-5)&\"'!E6\")","v":{"v":0,"d":"0.0"}},{"v":0,"d":"0.0"},{"$nulls":3},0,0,0,0,0,0,0,0,0,0,0,0,0,0,0,0,0,0,0,0,0]
[16000,{"$nulls":10},""]
[{"$nulls":11},{"$f":"IF(AND(J121<>\"\",K121<>\"\"),J121*K121,\"\")","v":""}]
[{"$f":"A100+1000","v":17000},{"$nulls":4},{"$f":"INDIRECT(CONCATENATE(\"Übersicht!C\",TEXT((A122-10000)/1000,0)))","v":"Leer"},{"$f":"MIN(G123:G137)","v":{"$error":"#N/A"}},{"$f":"MAX(H123:H137)","v":{"$error":"#N/A"}},{"$nulls":3},"",{"$f":"SUMIF(A$12:A$519,A122,L$12:L$519)","v":{"v":0,"d":"0.0"}},null,{"$f":"F122","v":"Leer"},{"$f":"SUM(P124:P141)","v":0},{"$f":"SUM(Q124:Q141)","v":0},0,0,0,0,0,0,0,0,0,0,0,0,0,0,0,0,0,0,0]
[{"$f":"A122","v":17000},{"$f":"A122+100","v":17100},{"$nulls":3},{"$f":"INDIRECT(OFFSET(F123,-1,0)&\"!B1\")","v":"Studie"},{"$f":"MIN(G124:G126)","v":"00:00:00"},{"$f":"MAX(H124:H126)","v":{"$error":"#N/A"}},{"$nulls":3},"",{"$f":"SUMIF(B$12:B$519,B123,L$12:L$519)","v":{"v":0,"d":"0.0"}}]
[{"$f":"A123","v":17000},{"$f":"B123","v":17100},{"$f":"B123+1","v":17101},null,"PL",{"$f":"OFFSET(F124,-2,0)&\" \"&OFFSET(F124,-1,0)&\" \"&INDIRECT(OFFSET(F124,-2,0)&\"!A4\")","v":"Leer Studie Projektleitung"},{"$f":"VLOOKUP(OFFSET(G124,-2,-1),Projektübersicht,3,0)","v":"00:00:00"},{"$f":"VLOOKUP(OFFSET(H124,-2,-2),Projektübersicht,4,0)","v":{"$error":"#N/A"}},{"$f":"\"Aus Top Down \"&OFFSET(I124,-2,-3)","v":"Aus Top Down Leer"},{"$f":"IF(ISNA(H124),0,1)","v":{"v":0,"d":"0.000"}},{"$f":"INDIRECT(\"'\"&OFFSET(K124,-2,-5)&\"'!B4\")","v":{"v":0,"d":"0.0"}},{"v":0,"d":"0.0"},{"$nulls":3},{"$f":"IF(ISNA($H124),0,zeitausschnitt($G124,$H124,$L124,P$9,P$10))","v":0},{"$f":"IF(ISNA($H124),0,zeitausschnitt($G124,$H124,$L124,Q$9,Q$10))","v":0},0,0,0,0,0,0,0,0,0,0,0,0,0,0,0,0,0,0,0]
[{"$f":"A124","v":17000},{"$f":"B124","v":17100},{"$f":"C124+1","v":17102},null,"Entwicklung",{"$f":"OFFSET(F125,-3,0)&\" \"&OFFSET(F125,-2,0)&\" \"&INDIRECT(OFFSET(F125,-3,0)&\"!A5\")","v":"Leer Studie Entwicklung"},{"$f":"G124","v":"00:00:00"},{"$f":"H124","v":{"$error":"#N/A"}},{"$f":"\"Aus Top Down \"&OFFSET(I125,-3,-3)","v":"Aus Top Down Leer"},{"$f":"IF(ISNA(H125),0,1)","v":{"v":0,"d":"0.000"}},{"$f":"INDIRECT(\"'\"&OFFSET(K125,-3,-5)&\"'!B5\")","v":{"v":0,"d":"0.0"}},{"v":0,"d":"0.0"},{"$nulls":3},{"$f":"IF(ISNA($H125),0,zeitausschnitt($G125,$H125,$L125,P$9,P$10))","v":0},0,0,0,0,0,0,0,0,0,0,0,0,0,0,0,0,0,0,0,0]
[17000,{"$f":"B125","v":17100},{"$f":"C125+1","v":17103},null,"Test",{"$f":"OFFSET(F126,-4,0)&\" \"&OFFSET(F126,-3,0)&\" \"&INDIRECT(OFFSET(F126,-4,0)&\"!A6\")","v":"Leer Studie Test"},{"$f":"G125","v":"00:00:00"},{"$f":"H125","v":{"$error":"#N/A"}},{"$f":"\"Aus Top Down \"&OFFSET(I126,-4,-3)","v":"Aus Top Down Leer"},{"$f":"IF(ISNA(H126),0,1)","v":{"v":0,"d":"0.000"}},{"$f":"INDIRECT(\"'\"&OFFSET(K126,-4,-5)&\"'!B6\")","v":{"v":0,"d":"0.0"}},{"v":0,"d":"0.0"},{"$nulls":3},0,0,0,0,0,0,0,0,0,0,0,0,0,0,0,0,0,0,0,0,0]
[17000,{"$nulls":10},""]
[17000,{"$f":"B123+100","v":17200},{"$nulls":3},{"$f":"INDIRECT(OFFSET(F128,-6,0)&\"!C1\")","v":"Konzept "},{"$f":"MIN(G129:G131)","v":{"$error":"#N/A"}},{"$f":"MAX(H129:H131)","v":{"$error":"#N/A"}},{"$nulls":3},"",{"$f":"SUMIF(B$12:B$519,B128,L$12:L$519)","v":{"v":0,"d":"0.0"}}]
[17000,{"$f":"B128","v":17200},{"$f":"B128+1","v":17201},null,"PL",{"$f":"OFFSET(F129,-7,0)&\" \"&OFFSET(F129,-1,0)&\" \"&INDIRECT(OFFSET(F129,-7,0)&\"!A4\")","v":"Leer Konzept  Projektleitung"},{"$f":"VLOOKUP(OFFSET(G129,-7,-1),Projektübersicht,4,0)","v":{"$error":"#N/A"}},{"$f":"VLOOKUP(OFFSET(H129,-7,-2),Projektübersicht,5,0)","v":{"$error":"#N/A"}},{"$f":"\"Aus Top Down \"&OFFSET(I129,-7,-3)","v":"Aus Top Down Leer"},{"$f":"IF(ISNA(H129),0,1)","v":{"v":0,"d":"0.000"}},{"$f":"INDIRECT(\"'\"&OFFSET(K129,-7,-5)&\"'!C4\")","v":{"v":0,"d":"0.0"}},{"v":0,"d":"0.0"},{"$nulls":3},{"$f":"IF(ISNA($H129),0,zeitausschnitt($G129,$H129,$L129,P$9,P$10))","v":0},{"$f":"IF(ISNA($H129),0,zeitausschnitt($G129,$H129,$L129,Q$9,Q$10))","v":0},0,0,0,0,0,0,0,0,0,0,0,0,0,0,0,0,0,0,0]
[17000,{"$f":"B129","v":17200},{"$f":"C129+1","v":17202},null,"Entwicklung",{"$f":"OFFSET(F130,-8,0)&\" \"&OFFSET(F130,-2,0)&\" \"&INDIRECT(OFFSET(F130,-8,0)&\"!A5\")","v":"Leer Konzept  Entwicklung"},{"$f":"G129","v":{"$error":"#N/A"}},{"$f":"H129","v":{"$error":"#N/A"}},{"$f":"\"Aus Top Down \"&OFFSET(I130,-8,-3)","v":"Aus Top Down Leer"},{"$f":"IF(ISNA(H130),0,1)","v":{"v":0,"d":"0.000"}},{"$f":"INDIRECT(\"'\"&OFFSET(K130,-8,-5)&\"'!C5\")","v":{"v":0,"d":"0.0"}},{"v":0,"d":"0.0"},{"$nulls":3},{"$f":"IF(ISNA($H130),0,zeitausschnitt($G130,$H130,$L130,P$9,P$10))","v":0},0,0,0,0,0,0,0,0,0,0,0,0,0,0,0,0,0,0,0,0]
[17000,{"$f":"B130","v":17200},{"$f":"C130+1","v":17203},null,"Test",{"$f":"OFFSET(F131,-9,0)&\" \"&OFFSET(F131,-3,0)&\" \"&INDIRECT(OFFSET(F131,-9,0)&\"!A6\")","v":"Leer Konzept  Test"},{"$f":"G130","v":{"$error":"#N/A"}},{"$f":"H130","v":{"$error":"#N/A"}},{"$f":"\"Aus Top Down \"&OFFSET(I131,-9,-3)","v":"Aus Top Down Leer"},{"$f":"IF(ISNA(H131),0,1)","v":{"v":0,"d":"0.000"}},{"$f":"INDIRECT(\"'\"&OFFSET(K131,-9,-5)&\"'!C6\")","v":{"v":0,"d":"0.0"}},{"v":0,"d":"0.0"},{"$nulls":3},0,0,0,0,0,0,0,0,0,0,0,0,0,0,0,0,0,0,0,0,0]
[17000,{"$nulls":10},""]
[17000,{"$f":"B128+100","v":17300},{"$nulls":3},{"$f":"INDIRECT(OFFSET(F133,-11,0)&\"!D1\")","v":"Entwicklung"},{"$f":"MIN(G134:G136)","v":{"$error":"#N/A"}},{"$f":"MAX(H134:H136)","v":{"$error":"#N/A"}},{"$nulls":3},"",{"$f":"SUMIF(B$12:B$519,B133,L$12:L$519)","v":{"v":0,"d":"0.0"}}]
[17000,{"$f":"B133","v":17300},{"$f":"B133+1","v":17301},null,"PL",{"$f":"OFFSET(F134,-12,0)&\" \"&OFFSET(F134,-1,0)&\" \"&INDIRECT(OFFSET(F134,-12,0)&\"!A4\")","v":"Leer Entwicklung Projektleitung"},{"$f":"VLOOKUP(OFFSET(G134,-12,-1),Projektübersicht,5,0)","v":{"$error":"#N/A"}},{"$f":"VLOOKUP(OFFSET(H134,-12,-2),Projektübersicht,6,0)","v":{"$error":"#N/A"}},{"$f":"\"Aus Top Down \"&OFFSET(I134,-12,-3)","v":"Aus Top Down Leer"},{"$f":"IF(ISNA(H134),0,1)","v":{"v":0,"d":"0.000"}},{"$f":"INDIRECT(\"'\"&OFFSET(K134,-12,-5)&\"'!D4\")","v":{"v":0,"d":"0.0"}},{"v":0,"d":"0.0"},{"$nulls":3},{"$f":"IF(ISNA($H134),0,zeitausschnitt($G134,$H134,$L134,P$9,P$10))","v":0},{"$f":"IF(ISNA($H134),0,zeitausschnitt($G134,$H134,$L134,Q$9,Q$10))","v":0},0,0,0,0,0,0,0,0,0,0,0,0,0,0,0,0,0,0,0]
[17000,{"$f":"B134","v":17300},{"$f":"C134+1","v":17302},null,"Entwicklung",{"$f":"OFFSET(F135,-13,0)&\" \"&OFFSET(F135,-2,0)&\" \"&INDIRECT(OFFSET(F135,-13,0)&\"!A5\")","v":"Leer Entwicklung Entwicklung"},{"$f":"G134","v":{"$error":"#N/A"}},{"$f":"H134","v":{"$error":"#N/A"}},{"$f":"\"Aus Top Down \"&OFFSET(I135,-13,-3)","v":"Aus Top Down Leer"},{"$f":"IF(ISNA(H135),0,1)","v":{"v":0,"d":"0.000"}},{"$f":"INDIRECT(\"'\"&OFFSET(K135,-13,-5)&\"'!D5\")","v":{"v":0,"d":"0.0"}},{"v":0,"d":"0.0"},{"$nulls":3},{"$f":"IF(ISNA($H135),0,zeitausschnitt($G135,$H135,$L135,P$9,P$10))","v":0},0,0,0,0,0,0,0,0,0,0,0,0,0,0,0,0,0,0,0,0]
[17000,{"$f":"B135","v":17300},{"$f":"C135+1","v":17303},null,"Test",{"$f":"OFFSET(F136,-14,0)&\" \"&OFFSET(F136,-3,0)&\" \"&INDIRECT(OFFSET(F136,-14,0)&\"!A6\")","v":"Leer Entwicklung Test"},{"$f":"G135","v":{"$error":"#N/A"}},{"$f":"H135","v":{"$error":"#N/A"}},{"$f":"\"Aus Top Down \"&OFFSET(I136,-14,-3)","v":"Aus Top Down Leer"},{"$f":"IF(ISNA(H136),0,1)","v":{"v":0,"d":"0.000"}},{"$f":"INDIRECT(\"'\"&OFFSET(K136,-14,-5)&\"'!D6\")","v":{"v":0,"d":"0.0"}},{"v":0,"d":"0.0"},{"$nulls":3},0,0,0,0,0,0,0,0,0,0,0,0,0,0,0,0,0,0,0,0,0]
[17000,{"$nulls":10},""]
[17000,{"$f":"B133+100","v":17400},{"$nulls":3},{"$f":"INDIRECT(OFFSET(F138,-16,0)&\"!E1\")","v":"Pflege"},{"$f":"MIN(G139:G141)","v":{"$error":"#N/A"}},{"$f":"MAX(H139:H141)","v":{"$error":"#N/A"}},{"$nulls":3},"",{"$f":"SUMIF(B$12:B$519,B138,L$12:L$519)","v":{"v":0,"d":"0.0"}}]
[17000,{"$f":"B138","v":17400},{"$f":"B138+1","v":17401},null,"PL",{"$f":"OFFSET(F139,-17,0)&\" \"&OFFSET(F139,-1,0)&\" \"&INDIRECT(OFFSET(F139,-17,0)&\"!A4\")","v":"Leer Pflege Projektleitung"},{"$f":"VLOOKUP(OFFSET(G139,-17,-1),Projektübersicht,6,0)","v":{"$error":"#N/A"}},{"$f":"VLOOKUP(OFFSET(H139,-17,-2),Projektübersicht,7,0)","v":{"$error":"#N/A"}},{"$f":"\"Aus Top Down \"&OFFSET(I139,-17,-3)","v":"Aus Top Down Leer"},{"$f":"IF(ISNA(H139),0,1)","v":{"v":0,"d":"0.000"}},{"$f":"INDIRECT(\"'\"&OFFSET(K139,-17,-5)&\"'!E4\")","v":{"v":0,"d":"0.0"}},{"v":0,"d":"0.0"},{"$nulls":3},{"$f":"IF(ISNA($H139),0,zeitausschnitt($G139,$H139,$L139,P$9,P$10))","v":0},{"$f":"IF(ISNA($H139),0,zeitausschnitt($G139,$H139,$L139,Q$9,Q$10))","v":0},0,0,0,0,0,0,0,0,0,0,0,0,0,0,0,0,0,0,0]
[17000,{"$f":"B139","v":17400},{"$f":"C139+1","v":17402},null,"Entwicklung",{"$f":"OFFSET(F140,-18,0)&\" \"&OFFSET(F140,-2,0)&\" \"&INDIRECT(OFFSET(F140,-18,0)&\"!A5\")","v":"Leer Pflege Entwicklung"},{"$f":"G139","v":{"$error":"#N/A"}},{"$f":"H139","v":{"$error":"#N/A"}},{"$f":"\"Aus Top Down \"&OFFSET(I140,-18,-3)","v":"Aus Top Down Leer"},{"$f":"IF(ISNA(H140),0,1)","v":{"v":0,"d":"0.000"}},{"$f":"INDIRECT(\"'\"&OFFSET(K140,-18,-5)&\"'!E5\")","v":{"v":0,"d":"0.0"}},{"v":0,"d":"0.0"},{"$nulls":3},{"$f":"IF(ISNA($H140),0,zeitausschnitt($G140,$H140,$L140,P$9,P$10))","v":0},0,0,0,0,0,0,0,0,0,0,0,0,0,0,0,0,0,0,0,0]
[17000,{"$f":"B140","v":17400},{"$f":"C140+1","v":17403},null,"Test",{"$f":"OFFSET(F141,-19,0)&\" \"&OFFSET(F141,-3,0)&\" \"&INDIRECT(OFFSET(F141,-19,0)&\"!A6\")","v":"Leer Pflege Test"},{"$f":"G140","v":{"$error":"#N/A"}},{"$f":"H140","v":{"$error":"#N/A"}},{"$f":"\"Aus Top Down \"&OFFSET(I141,-19,-3)","v":"Aus Top Down Leer"},{"$f":"IF(ISNA(H141),0,1)","v":{"v":0,"d":"0.000"}},{"$f":"INDIRECT(\"'\"&OFFSET(K141,-19,-5)&\"'!E6\")","v":{"v":0,"d":"0.0"}},{"v":0,"d":"0.0"},{"$nulls":3},0,0,0,0,0,0,0,0,0,0,0,0,0,0,0,0,0,0,0,0,0]
[17000,{"$nulls":10},""]
[{"$nulls":11},{"$f":"IF(AND(J143<>\"\",K143<>\"\"),J143*K143,\"\")","v":""}]
[{"$f":"A122+1000","v":18000},{"$nulls":4},{"$f":"INDIRECT(CONCATENATE(\"Übersicht!C\",TEXT((A144-10000)/1000,0)))","v":"Leer"},{"$f":"MIN(G145:G159)","v":{"$error":"#N/A"}},{"$f":"MAX(H145:H159)","v":{"$error":"#N/A"}},{"$nulls":3},"",{"$f":"SUMIF(A$12:A$519,A144,L$12:L$519)","v":{"v":0,"d":"0.0"}},null,{"$f":"F144","v":"Leer"},{"$f":"SUM(P146:P163)","v":0},{"$f":"SUM(Q146:Q163)","v":0},0,0,0,0,0,0,0,0,0,0,0,0,0,0,0,0,0,0,0]
[{"$f":"A144","v":18000},{"$f":"A144+100","v":18100},{"$nulls":3},{"$f":"INDIRECT(OFFSET(F145,-1,0)&\"!B1\")","v":"Studie"},{"$f":"MIN(G146:G148)","v":"00:00:00"},{"$f":"MAX(H146:H148)","v":{"$error":"#N/A"}},{"$nulls":3},"",{"$f":"SUMIF(B$12:B$519,B145,L$12:L$519)","v":{"v":0,"d":"0.0"}}]
[{"$f":"A145","v":18000},{"$f":"B145","v":18100},{"$f":"B145+1","v":18101},null,"PL",{"$f":"OFFSET(F146,-2,0)&\" \"&OFFSET(F146,-1,0)&\" \"&INDIRECT(OFFSET(F146,-2,0)&\"!A4\")","v":"Leer Studie Projektleitung"},{"$f":"VLOOKUP(OFFSET(G146,-2,-1),Projektübersicht,3,0)","v":"00:00:00"},{"$f":"VLOOKUP(OFFSET(H146,-2,-2),Projektübersicht,4,0)","v":{"$error":"#N/A"}},{"$f":"\"Aus Top Down \"&OFFSET(I146,-2,-3)","v":"Aus Top Down Leer"},{"$f":"IF(ISNA(H146),0,1)","v":{"v":0,"d":"0.000"}},{"$f":"INDIRECT(\"'\"&OFFSET(K146,-2,-5)&\"'!B4\")","v":{"v":0,"d":"0.0"}},{"v":0,"d":"0.0"},{"$nulls":3},{"$f":"IF(ISNA($H146),0,zeitausschnitt($G146,$H146,$L146,P$9,P$10))","v":0},{"$f":"IF(ISNA($H146),0,zeitausschnitt($G146,$H146,$L146,Q$9,Q$10))","v":0},0,0,0,0,0,0,0,0,0,0,0,0,0,0,0,0,0,0,0]
[{"$f":"A146","v":18000},{"$f":"B146","v":18100},{"$f":"C146+1","v":18102},null,"Entwicklung",{"$f":"OFFSET(F147,-3,0)&\" \"&OFFSET(F147,-2,0)&\" \"&INDIRECT(OFFSET(F147,-3,0)&\"!A5\")","v":"Leer Studie Entwicklung"},{"$f":"G146","v":"00:00:00"},{"$f":"H146","v":{"$error":"#N/A"}},{"$f":"\"Aus Top Down \"&OFFSET(I147,-3,-3)","v":"Aus Top Down Leer"},{"$f":"IF(ISNA(H147),0,1)","v":{"v":0,"d":"0.000"}},{"$f":"INDIRECT(\"'\"&OFFSET(K147,-3,-5)&\"'!B5\")","v":{"v":0,"d":"0.0"}},{"v":0,"d":"0.0"},{"$nulls":3},{"$f":"IF(ISNA($H147),0,zeitausschnitt($G147,$H147,$L147,P$9,P$10))","v":0},0,0,0,0,0,0,0,0,0,0,0,0,0,0,0,0,0,0,0,0]
[18000,{"$f":"B147","v":18100},{"$f":"C147+1","v":18103},null,"Test",{"$f":"OFFSET(F148,-4,0)&\" \"&OFFSET(F148,-3,0)&\" \"&INDIRECT(OFFSET(F148,-4,0)&\"!A6\")","v":"Leer Studie Test"},{"$f":"G147","v":"00:00:00"},{"$f":"H147","v":{"$error":"#N/A"}},{"$f":"\"Aus Top Down \"&OFFSET(I148,-4,-3)","v":"Aus Top Down Leer"},{"$f":"IF(ISNA(H148),0,1)","v":{"v":0,"d":"0.000"}},{"$f":"INDIRECT(\"'\"&OFFSET(K148,-4,-5)&\"'!B6\")","v":{"v":0,"d":"0.0"}},{"v":0,"d":"0.0"},{"$nulls":3},0,0,0,0,0,0,0,0,0,0,0,0,0,0,0,0,0,0,0,0,0]
[18000,{"$nulls":10},""]
[18000,{"$f":"B145+100","v":18200},{"$nulls":3},{"$f":"INDIRECT(OFFSET(F150,-6,0)&\"!C1\")","v":"Konzept "},{"$f":"MIN(G151:G153)","v":{"$error":"#N/A"}},{"$f":"MAX(H151:H153)","v":{"$error":"#N/A"}},{"$nulls":3},"",{"$f":"SUMIF(B$12:B$519,B150,L$12:L$519)","v":{"v":0,"d":"0.0"}}]
[18000,{"$f":"B150","v":18200},{"$f":"B150+1","v":18201},null,"PL",{"$f":"OFFSET(F151,-7,0)&\" \"&OFFSET(F151,-1,0)&\" \"&INDIRECT(OFFSET(F151,-7,0)&\"!A4\")","v":"Leer Konzept  Projektleitung"},{"$f":"VLOOKUP(OFFSET(G151,-7,-1),Projektübersicht,4,0)","v":{"$error":"#N/A"}},{"$f":"VLOOKUP(OFFSET(H151,-7,-2),Projektübersicht,5,0)","v":{"$error":"#N/A"}},{"$f":"\"Aus Top Down \"&OFFSET(I151,-7,-3)","v":"Aus Top Down Leer"},{"$f":"IF(ISNA(H151),0,1)","v":{"v":0,"d":"0.000"}},{"$f":"INDIRECT(\"'\"&OFFSET(K151,-7,-5)&\"'!C4\")","v":{"v":0,"d":"0.0"}},{"v":0,"d":"0.0"},{"$nulls":3},{"$f":"IF(ISNA($H151),0,zeitausschnitt($G151,$H151,$L151,P$9,P$10))","v":0},{"$f":"IF(ISNA($H151),0,zeitausschnitt($G151,$H151,$L151,Q$9,Q$10))","v":0},0,0,0,0,0,0,0,0,0,0,0,0,0,0,0,0,0,0,0]
[18000,{"$f":"B151","v":18200},{"$f":"C151+1","v":18202},null,"Entwicklung",{"$f":"OFFSET(F152,-8,0)&\" \"&OFFSET(F152,-2,0)&\" \"&INDIRECT(OFFSET(F152,-8,0)&\"!A5\")","v":"Leer Konzept  Entwicklung"},{"$f":"G151","v":{"$error":"#N/A"}},{"$f":"H151","v":{"$error":"#N/A"}},{"$f":"\"Aus Top Down \"&OFFSET(I152,-8,-3)","v":"Aus Top Down Leer"},{"$f":"IF(ISNA(H152),0,1)","v":{"v":0,"d":"0.000"}},{"$f":"INDIRECT(\"'\"&OFFSET(K152,-8,-5)&\"'!C5\")","v":{"v":0,"d":"0.0"}},{"v":0,"d":"0.0"},{"$nulls":3},{"$f":"IF(ISNA($H152),0,zeitausschnitt($G152,$H152,$L152,P$9,P$10))","v":0},0,0,0,0,0,0,0,0,0,0,0,0,0,0,0,0,0,0,0,0]
[18000,{"$f":"B152","v":18200},{"$f":"C152+1","v":18203},null,"Test",{"$f":"OFFSET(F153,-9,0)&\" \"&OFFSET(F153,-3,0)&\" \"&INDIRECT(OFFSET(F153,-9,0)&\"!A6\")","v":"Leer Konzept  Test"},{"$f":"G152","v":{"$error":"#N/A"}},{"$f":"H152","v":{"$error":"#N/A"}},{"$f":"\"Aus Top Down \"&OFFSET(I153,-9,-3)","v":"Aus Top Down Leer"},{"$f":"IF(ISNA(H153),0,1)","v":{"v":0,"d":"0.000"}},{"$f":"INDIRECT(\"'\"&OFFSET(K153,-9,-5)&\"'!C6\")","v":{"v":0,"d":"0.0"}},{"v":0,"d":"0.0"},{"$nulls":3},0,0,0,0,0,0,0,0,0,0,0,0,0,0,0,0,0,0,0,0,0]
[18000,{"$nulls":10},""]
[18000,{"$f":"B150+100","v":18300},{"$nulls":3},{"$f":"INDIRECT(OFFSET(F155,-11,0)&\"!D1\")","v":"Entwicklung"},{"$f":"MIN(G156:G158)","v":{"$error":"#N/A"}},{"$f":"MAX(H156:H158)","v":{"$error":"#N/A"}},{"$nulls":3},"",{"$f":"SUMIF(B$12:B$519,B155,L$12:L$519)","v":{"v":0,"d":"0.0"}}]
[18000,{"$f":"B155","v":18300},{"$f":"B155+1","v":18301},null,"PL",{"$f":"OFFSET(F156,-12,0)&\" \"&OFFSET(F156,-1,0)&\" \"&INDIRECT(OFFSET(F156,-12,0)&\"!A4\")","v":"Leer Entwicklung Projektleitung"},{"$f":"VLOOKUP(OFFSET(G156,-12,-1),Projektübersicht,5,0)","v":{"$error":"#N/A"}},{"$f":"VLOOKUP(OFFSET(H156,-12,-2),Projektübersicht,6,0)","v":{"$error":"#N/A"}},{"$f":"\"Aus Top Down \"&OFFSET(I156,-12,-3)","v":"Aus Top Down Leer"},{"$f":"IF(ISNA(H156),0,1)","v":{"v":0,"d":"0.000"}},{"$f":"INDIRECT(\"'\"&OFFSET(K156,-12,-5)&\"'!D4\")","v":{"v":0,"d":"0.0"}},{"v":0,"d":"0.0"},{"$nulls":3},{"$f":"IF(ISNA($H156),0,zeitausschnitt($G156,$H156,$L156,P$9,P$10))","v":0},{"$f":"IF(ISNA($H156),0,zeitausschnitt($G156,$H156,$L156,Q$9,Q$10))","v":0},0,0,0,0,0,0,0,0,0,0,0,0,0,0,0,0,0,0,0]
[18000,{"$f":"B156","v":18300},{"$f":"C156+1","v":18302},null,"Entwicklung",{"$f":"OFFSET(F157,-13,0)&\" \"&OFFSET(F157,-2,0)&\" \"&INDIRECT(OFFSET(F157,-13,0)&\"!A5\")","v":"Leer Entwicklung Entwicklung"},{"$f":"G156","v":{"$error":"#N/A"}},{"$f":"H156","v":{"$error":"#N/A"}},{"$f":"\"Aus Top Down \"&OFFSET(I157,-13,-3)","v":"Aus Top Down Leer"},{"$f":"IF(ISNA(H157),0,1)","v":{"v":0,"d":"0.000"}},{"$f":"INDIRECT(\"'\"&OFFSET(K157,-13,-5)&\"'!D5\")","v":{"v":0,"d":"0.0"}},{"v":0,"d":"0.0"},{"$nulls":3},{"$f":"IF(ISNA($H157),0,zeitausschnitt($G157,$H157,$L157,P$9,P$10))","v":0},0,0,0,0,0,0,0,0,0,0,0,0,0,0,0,0,0,0,0,0]
[18000,{"$f":"B157","v":18300},{"$f":"C157+1","v":18303},null,"Test",{"$f":"OFFSET(F158,-14,0)&\" \"&OFFSET(F158,-3,0)&\" \"&INDIRECT(OFFSET(F158,-14,0)&\"!A6\")","v":"Leer Entwicklung Test"},{"$f":"G157","v":{"$error":"#N/A"}},{"$f":"H157","v":{"$error":"#N/A"}},{"$f":"\"Aus Top Down \"&OFFSET(I158,-14,-3)","v":"Aus Top Down Leer"},{"$f":"IF(ISNA(H158),0,1)","v":{"v":0,"d":"0.000"}},{"$f":"INDIRECT(\"'\"&OFFSET(K158,-14,-5)&\"'!D6\")","v":{"v":0,"d":"0.0"}},{"v":0,"d":"0.0"},{"$nulls":3},0,0,0,0,0,0,0,0,0,0,0,0,0,0,0,0,0,0,0,0,0]
[18000,{"$nulls":10},""]
[18000,{"$f":"B155+100","v":18400},{"$nulls":3},{"$f":"INDIRECT(OFFSET(F160,-16,0)&\"!E1\")","v":"Pflege"},{"$f":"MIN(G161:G163)","v":{"$error":"#N/A"}},{"$f":"MAX(H161:H163)","v":{"$error":"#N/A"}},{"$nulls":3},"",{"$f":"SUMIF(B$12:B$519,B160,L$12:L$519)","v":{"v":0,"d":"0.0"}}]
[18000,{"$f":"B160","v":18400},{"$f":"B160+1","v":18401},null,"PL",{"$f":"OFFSET(F161,-17,0)&\" \"&OFFSET(F161,-1,0)&\" \"&INDIRECT(OFFSET(F161,-17,0)&\"!A4\")","v":"Leer Pflege Projektleitung"},{"$f":"VLOOKUP(OFFSET(G161,-17,-1),Projektübersicht,6,0)","v":{"$error":"#N/A"}},{"$f":"VLOOKUP(OFFSET(H161,-17,-2),Projektübersicht,7,0)","v":{"$error":"#N/A"}},{"$f":"\"Aus Top Down \"&OFFSET(I161,-17,-3)","v":"Aus Top Down Leer"},{"$f":"IF(ISNA(H161),0,1)","v":{"v":0,"d":"0.000"}},{"$f":"INDIRECT(\"'\"&OFFSET(K161,-17,-5)&\"'!E4\")","v":{"v":0,"d":"0.0"}},{"v":0,"d":"0.0"},{"$nulls":3},{"$f":"IF(ISNA($H161),0,zeitausschnitt($G161,$H161,$L161,P$9,P$10))","v":0},{"$f":"IF(ISNA($H161),0,zeitausschnitt($G161,$H161,$L161,Q$9,Q$10))","v":0},0,0,0,0,0,0,0,0,0,0,0,0,0,0,0,0,0,0,0]
[18000,{"$f":"B161","v":18400},{"$f":"C161+1","v":18402},null,"Entwicklung",{"$f":"OFFSET(F162,-18,0)&\" \"&OFFSET(F162,-2,0)&\" \"&INDIRECT(OFFSET(F162,-18,0)&\"!A5\")","v":"Leer Pflege Entwicklung"},{"$f":"G161","v":{"$error":"#N/A"}},{"$f":"H161","v":{"$error":"#N/A"}},{"$f":"\"Aus Top Down \"&OFFSET(I162,-18,-3)","v":"Aus Top Down Leer"},{"$f":"IF(ISNA(H162),0,1)","v":{"v":0,"d":"0.000"}},{"$f":"INDIRECT(\"'\"&OFFSET(K162,-18,-5)&\"'!E5\")","v":{"v":0,"d":"0.0"}},{"v":0,"d":"0.0"},{"$nulls":3},{"$f":"IF(ISNA($H162),0,zeitausschnitt($G162,$H162,$L162,P$9,P$10))","v":0},0,0,0,0,0,0,0,0,0,0,0,0,0,0,0,0,0,0,0,0]
[18000,{"$f":"B162","v":18400},{"$f":"C162+1","v":18403},null,"Test",{"$f":"OFFSET(F163,-19,0)&\" \"&OFFSET(F163,-3,0)&\" \"&INDIRECT(OFFSET(F163,-19,0)&\"!A6\")","v":"Leer Pflege Test"},{"$f":"G162","v":{"$error":"#N/A"}},{"$f":"H162","v":{"$error":"#N/A"}},{"$f":"\"Aus Top Down \"&OFFSET(I163,-19,-3)","v":"Aus Top Down Leer"},{"$f":"IF(ISNA(H163),0,1)","v":{"v":0,"d":"0.000"}},{"$f":"INDIRECT(\"'\"&OFFSET(K163,-19,-5)&\"'!E6\")","v":{"v":0,"d":"0.0"}},{"v":0,"d":"0.0"},{"$nulls":3},0,0,0,0,0,0,0,0,0,0,0,0,0,0,0,0,0,0,0,0,0]
[18000,{"$nulls":10},""]
[{"$nulls":11},{"$f":"IF(AND(J165<>\"\",K165<>\"\"),J165*K165,\"\")","v":""}]
[{"$f":"A145+1000","v":19000},{"$nulls":4},{"$f":"INDIRECT(CONCATENATE(\"Übersicht!C\",TEXT((A166-10000)/1000,0)))","v":"Leer"},{"$f":"MIN(G167:G181)","v":{"$error":"#N/A"}},{"$f":"MAX(H167:H181)","v":{"$error":"#N/A"}},{"$nulls":3},"",{"$f":"SUMIF(A$12:A$519,A166,L$12:L$519)","v":{"v":0,"d":"0.0"}},null,{"$f":"F166","v":"Leer"},{"$f":"SUM(P168:P185)","v":0},{"$f":"SUM(Q168:Q185)","v":0},0,0,0,0,0,0,0,0,0,0,0,0,0,0,0,0,0,0,0]
[{"$f":"A166","v":19000},{"$f":"A166+100","v":19100},{"$nulls":3},{"$f":"INDIRECT(OFFSET(F167,-1,0)&\"!B1\")","v":"Studie"},{"$f":"MIN(G168:G170)","v":"00:00:00"},{"$f":"MAX(H168:H170)","v":{"$error":"#N/A"}},{"$nulls":3},"",{"$f":"SUMIF(B$12:B$519,B167,L$12:L$519)","v":{"v":0,"d":"0.0"}}]
[{"$f":"A167","v":19000},{"$f":"B167","v":19100},{"$f":"B167+1","v":19101},null,"PL",{"$f":"OFFSET(F168,-2,0)&\" \"&OFFSET(F168,-1,0)&\" \"&INDIRECT(OFFSET(F168,-2,0)&\"!A4\")","v":"Leer Studie Projektleitung"},{"$f":"VLOOKUP(OFFSET(G168,-2,-1),Projektübersicht,3,0)","v":"00:00:00"},{"$f":"VLOOKUP(OFFSET(H168,-2,-2),Projektübersicht,4,0)","v":{"$error":"#N/A"}},{"$f":"\"Aus Top Down \"&OFFSET(I168,-2,-3)","v":"Aus Top Down Leer"},{"$f":"IF(ISNA(H168),0,1)","v":{"v":0,"d":"0.000"}},{"$f":"INDIRECT(\"'\"&OFFSET(K168,-2,-5)&\"'!B4\")","v":{"v":0,"d":"0.0"}},{"v":0,"d":"0.0"},{"$nulls":3},{"$f":"IF(ISNA($H168),0,zeitausschnitt($G168,$H168,$L168,P$9,P$10))","v":0},{"$f":"IF(ISNA($H168),0,zeitausschnitt($G168,$H168,$L168,Q$9,Q$10))","v":0},0,0,0,0,0,0,0,0,0,0,0,0,0,0,0,0,0,0,0]
[{"$f":"A168","v":19000},{"$f":"B168","v":19100},{"$f":"C168+1","v":19102},null,"Entwicklung",{"$f":"OFFSET(F169,-3,0)&\" \"&OFFSET(F169,-2,0)&\" \"&INDIRECT(OFFSET(F169,-3,0)&\"!A5\")","v":"Leer Studie Entwicklung"},{"$f":"G168","v":"00:00:00"},{"$f":"H168","v":{"$error":"#N/A"}},{"$f":"\"Aus Top Down \"&OFFSET(I169,-3,-3)","v":"Aus Top Down Leer"},{"$f":"IF(ISNA(H169),0,1)","v":{"v":0,"d":"0.000"}},{"$f":"INDIRECT(\"'\"&OFFSET(K169,-3,-5)&\"'!B5\")","v":{"v":0,"d":"0.0"}},{"v":0,"d":"0.0"},{"$nulls":3},{"$f":"IF(ISNA($H169),0,zeitausschnitt($G169,$H169,$L169,P$9,P$10))","v":0},0,0,0,0,0,0,0,0,0,0,0,0,0,0,0,0,0,0,0,0]
[19000,{"$f":"B169","v":19100},{"$f":"C169+1","v":19103},null,"Test",{"$f":"OFFSET(F170,-4,0)&\" \"&OFFSET(F170,-3,0)&\" \"&INDIRECT(OFFSET(F170,-4,0)&\"!A6\")","v":"Leer Studie Test"},{"$f":"G169","v":"00:00:00"},{"$f":"H169","v":{"$error":"#N/A"}},{"$f":"\"Aus Top Down \"&OFFSET(I170,-4,-3)","v":"Aus Top Down Leer"},{"$f":"IF(ISNA(H170),0,1)","v":{"v":0,"d":"0.000"}},{"$f":"INDIRECT(\"'\"&OFFSET(K170,-4,-5)&\"'!B6\")","v":{"v":0,"d":"0.0"}},{"v":0,"d":"0.0"},{"$nulls":3},0,0,0,0,0,0,0,0,0,0,0,0,0,0,0,0,0,0,0,0,0]
[19000,{"$nulls":10},""]
[19000,{"$f":"B167+100","v":19200},{"$nulls":3},{"$f":"INDIRECT(OFFSET(F172,-6,0)&\"!C1\")","v":"Konzept "},{"$f":"MIN(G173:G175)","v":{"$error":"#N/A"}},{"$f":"MAX(H173:H175)","v":{"$error":"#N/A"}},{"$nulls":3},"",{"$f":"SUMIF(B$12:B$519,B172,L$12:L$519)","v":{"v":0,"d":"0.0"}}]
[19000,{"$f":"B172","v":19200},{"$f":"B172+1","v":19201},null,"PL",{"$f":"OFFSET(F173,-7,0)&\" \"&OFFSET(F173,-1,0)&\" \"&INDIRECT(OFFSET(F173,-7,0)&\"!A4\")","v":"Leer Konzept  Projektleitung"},{"$f":"VLOOKUP(OFFSET(G173,-7,-1),Projektübersicht,4,0)","v":{"$error":"#N/A"}},{"$f":"VLOOKUP(OFFSET(H173,-7,-2),Projektübersicht,5,0)","v":{"$error":"#N/A"}},{"$f":"\"Aus Top Down \"&OFFSET(I173,-7,-3)","v":"Aus Top Down Leer"},{"$f":"IF(ISNA(H173),0,1)","v":{"v":0,"d":"0.000"}},{"$f":"INDIRECT(\"'\"&OFFSET(K173,-7,-5)&\"'!C4\")","v":{"v":0,"d":"0.0"}},{"v":0,"d":"0.0"},{"$nulls":3},{"$f":"IF(ISNA($H173),0,zeitausschnitt($G173,$H173,$L173,P$9,P$10))","v":0},{"$f":"IF(ISNA($H173),0,zeitausschnitt($G173,$H173,$L173,Q$9,Q$10))","v":0},0,0,0,0,0,0,0,0,0,0,0,0,0,0,0,0,0,0,0]
[19000,{"$f":"B173","v":19200},{"$f":"C173+1","v":19202},null,"Entwicklung",{"$f":"OFFSET(F174,-8,0)&\" \"&OFFSET(F174,-2,0)&\" \"&INDIRECT(OFFSET(F174,-8,0)&\"!A5\")","v":"Leer Konzept  Entwicklung"},{"$f":"G173","v":{"$error":"#N/A"}},{"$f":"H173","v":{"$error":"#N/A"}},{"$f":"\"Aus Top Down \"&OFFSET(I174,-8,-3)","v":"Aus Top Down Leer"},{"$f":"IF(ISNA(H174),0,1)","v":{"v":0,"d":"0.000"}},{"$f":"INDIRECT(\"'\"&OFFSET(K174,-8,-5)&\"'!C5\")","v":{"v":0,"d":"0.0"}},{"v":0,"d":"0.0"},{"$nulls":3},{"$f":"IF(ISNA($H174),0,zeitausschnitt($G174,$H174,$L174,P$9,P$10))","v":0},0,0,0,0,0,0,0,0,0,0,0,0,0,0,0,0,0,0,0,0]
[19000,{"$f":"B174","v":19200},{"$f":"C174+1","v":19203},null,"Test",{"$f":"OFFSET(F175,-9,0)&\" \"&OFFSET(F175,-3,0)&\" \"&INDIRECT(OFFSET(F175,-9,0)&\"!A6\")","v":"Leer Konzept  Test"},{"$f":"G174","v":{"$error":"#N/A"}},{"$f":"H174","v":{"$error":"#N/A"}},{"$f":"\"Aus Top Down \"&OFFSET(I175,-9,-3)","v":"Aus Top Down Leer"},{"$f":"IF(ISNA(H175),0,1)","v":{"v":0,"d":"0.000"}},{"$f":"INDIRECT(\"'\"&OFFSET(K175,-9,-5)&\"'!C6\")","v":{"v":0,"d":"0.0"}},{"v":0,"d":"0.0"},{"$nulls":3},0,0,0,0,0,0,0,0,0,0,0,0,0,0,0,0,0,0,0,0,0]
[19000,{"$nulls":10},""]
[19000,{"$f":"B172+100","v":19300},{"$nulls":3},{"$f":"INDIRECT(OFFSET(F177,-11,0)&\"!D1\")","v":"Entwicklung"},{"$f":"MIN(G178:G180)","v":{"$error":"#N/A"}},{"$f":"MAX(H178:H180)","v":{"$error":"#N/A"}},{"$nulls":3},"",{"$f":"SUMIF(B$12:B$519,B177,L$12:L$519)","v":{"v":0,"d":"0.0"}}]
[19000,{"$f":"B177","v":19300},{"$f":"B177+1","v":19301},null,"PL",{"$f":"OFFSET(F178,-12,0)&\" \"&OFFSET(F178,-1,0)&\" \"&INDIRECT(OFFSET(F178,-12,0)&\"!A4\")","v":"Leer Entwicklung Projektleitung"},{"$f":"VLOOKUP(OFFSET(G178,-12,-1),Projektübersicht,5,0)","v":{"$error":"#N/A"}},{"$f":"VLOOKUP(OFFSET(H178,-12,-2),Projektübersicht,6,0)","v":{"$error":"#N/A"}},{"$f":"\"Aus Top Down \"&OFFSET(I178,-12,-3)","v":"Aus Top Down Leer"},{"$f":"IF(ISNA(H178),0,1)","v":{"v":0,"d":"0.000"}},{"$f":"INDIRECT(\"'\"&OFFSET(K178,-12,-5)&\"'!D4\")","v":{"v":0,"d":"0.0"}},{"v":0,"d":"0.0"},{"$nulls":3},{"$f":"IF(ISNA($H178),0,zeitausschnitt($G178,$H178,$L178,P$9,P$10))","v":0},{"$f":"IF(ISNA($H178),0,zeitausschnitt($G178,$H178,$L178,Q$9,Q$10))","v":0},0,0,0,0,0,0,0,0,0,0,0,0,0,0,0,0,0,0,0]
[19000,{"$f":"B178","v":19300},{"$f":"C178+1","v":19302},null,"Entwicklung",{"$f":"OFFSET(F179,-13,0)&\" \"&OFFSET(F179,-2,0)&\" \"&INDIRECT(OFFSET(F179,-13,0)&\"!A5\")","v":"Leer Entwicklung Entwicklung"},{"$f":"G178","v":{"$error":"#N/A"}},{"$f":"H178","v":{"$error":"#N/A"}},{"$f":"\"Aus Top Down \"&OFFSET(I179,-13,-3)","v":"Aus Top Down Leer"},{"$f":"IF(ISNA(H179),0,1)","v":{"v":0,"d":"0.000"}},{"$f":"INDIRECT(\"'\"&OFFSET(K179,-13,-5)&\"'!D5\")","v":{"v":0,"d":"0.0"}},{"v":0,"d":"0.0"},{"$nulls":3},{"$f":"IF(ISNA($H179),0,zeitausschnitt($G179,$H179,$L179,P$9,P$10))","v":0},0,0,0,0,0,0,0,0,0,0,0,0,0,0,0,0,0,0,0,0]
[19000,{"$f":"B179","v":19300},{"$f":"C179+1","v":19303},null,"Test",{"$f":"OFFSET(F180,-14,0)&\" \"&OFFSET(F180,-3,0)&\" \"&INDIRECT(OFFSET(F180,-14,0)&\"!A6\")","v":"Leer Entwicklung Test"},{"$f":"G179","v":{"$error":"#N/A"}},{"$f":"H179","v":{"$error":"#N/A"}},{"$f":"\"Aus Top Down \"&OFFSET(I180,-14,-3)","v":"Aus Top Down Leer"},{"$f":"IF(ISNA(H180),0,1)","v":{"v":0,"d":"0.000"}},{"$f":"INDIRECT(\"'\"&OFFSET(K180,-14,-5)&\"'!D6\")","v":{"v":0,"d":"0.0"}},{"v":0,"d":"0.0"},{"$nulls":3},0,0,0,0,0,0,0,0,0,0,0,0,0,0,0,0,0,0,0,0,0]
[19000,{"$nulls":10},""]
[19000,{"$f":"B177+100","v":19400},{"$nulls":3},{"$f":"INDIRECT(OFFSET(F182,-16,0)&\"!E1\")","v":"Pflege"},{"$f":"MIN(G183:G185)","v":{"$error":"#N/A"}},{"$f":"MAX(H183:H185)","v":{"$error":"#N/A"}},{"$nulls":3},"",{"$f":"SUMIF(B$12:B$519,B182,L$12:L$519)","v":{"v":0,"d":"0.0"}}]
[19000,{"$f":"B182","v":19400},{"$f":"B182+1","v":19401},null,"PL",{"$f":"OFFSET(F183,-17,0)&\" \"&OFFSET(F183,-1,0)&\" \"&INDIRECT(OFFSET(F183,-17,0)&\"!A4\")","v":"Leer Pflege Projektleitung"},{"$f":"VLOOKUP(OFFSET(G183,-17,-1),Projektübersicht,6,0)","v":{"$error":"#N/A"}},{"$f":"VLOOKUP(OFFSET(H183,-17,-2),Projektübersicht,7,0)","v":{"$error":"#N/A"}},{"$f":"\"Aus Top Down \"&OFFSET(I183,-17,-3)","v":"Aus Top Down Leer"},{"$f":"IF(ISNA(H183),0,1)","v":{"v":0,"d":"0.000"}},{"$f":"INDIRECT(\"'\"&OFFSET(K183,-17,-5)&\"'!E4\")","v":{"v":0,"d":"0.0"}},{"v":0,"d":"0.0"},{"$nulls":3},{"$f":"IF(ISNA($H183),0,zeitausschnitt($G183,$H183,$L183,P$9,P$10))","v":0},{"$f":"IF(ISNA($H183),0,zeitausschnitt($G183,$H183,$L183,Q$9,Q$10))","v":0},0,0,0,0,0,0,0,0,0,0,0,0,0,0,0,0,0,0,0]
[19000,{"$f":"B183","v":19400},{"$f":"C183+1","v":19402},null,"Entwicklung",{"$f":"OFFSET(F184,-18,0)&\" \"&OFFSET(F184,-2,0)&\" \"&INDIRECT(OFFSET(F184,-18,0)&\"!A5\")","v":"Leer Pflege Entwicklung"},{"$f":"G183","v":{"$error":"#N/A"}},{"$f":"H183","v":{"$error":"#N/A"}},{"$f":"\"Aus Top Down \"&OFFSET(I184,-18,-3)","v":"Aus Top Down Leer"},{"$f":"IF(ISNA(H184),0,1)","v":{"v":0,"d":"0.000"}},{"$f":"INDIRECT(\"'\"&OFFSET(K184,-18,-5)&\"'!E5\")","v":{"v":0,"d":"0.0"}},{"v":0,"d":"0.0"},{"$nulls":3},{"$f":"IF(ISNA($H184),0,zeitausschnitt($G184,$H184,$L184,P$9,P$10))","v":0},0,0,0,0,0,0,0,0,0,0,0,0,0,0,0,0,0,0,0,0]
[19000,{"$f":"B184","v":19400},{"$f":"C184+1","v":19403},null,"Test",{"$f":"OFFSET(F185,-19,0)&\" \"&OFFSET(F185,-3,0)&\" \"&INDIRECT(OFFSET(F185,-19,0)&\"!A6\")","v":"Leer Pflege Test"},{"$f":"G184","v":{"$error":"#N/A"}},{"$f":"H184","v":{"$error":"#N/A"}},{"$f":"\"Aus Top Down \"&OFFSET(I185,-19,-3)","v":"Aus Top Down Leer"},{"$f":"IF(ISNA(H185),0,1)","v":{"v":0,"d":"0.000"}},{"$f":"INDIRECT(\"'\"&OFFSET(K185,-19,-5)&\"'!E6\")","v":{"v":0,"d":"0.0"}},{"v":0,"d":"0.0"},{"$nulls":3},0,0,0,0,0,0,0,0,0,0,0,0,0,0,0,0,0,0,0,0,0]
[19000,{"$nulls":10},""]
[{"$nulls":11},""]
[{"$f":"A166+1000","v":20000},{"$nulls":4},{"$f":"INDIRECT(CONCATENATE(\"Übersicht!C\",TEXT((A188-10000)/1000,0)))","v":"Leer"},{"$f":"MIN(G189:G203)","v":{"$error":"#N/A"}},{"$f":"MAX(H189:H203)","v":{"$error":"#N/A"}},{"$nulls":3},"",{"$f":"SUMIF(A$12:A$519,A188,L$12:L$519)","v":{"v":0,"d":"0.0"}},null,{"$f":"F188","v":"Leer"},{"$f":"SUM(P190:P207)","v":0},{"$f":"SUM(Q190:Q207)","v":0},0,0,0,0,0,0,0,0,0,0,0,0,0,0,0,0,0,0,0]
[{"$f":"A188","v":20000},{"$f":"A188+100","v":20100},{"$nulls":3},{"$f":"INDIRECT(OFFSET(F189,-1,0)&\"!B1\")","v":"Studie"},{"$f":"MIN(G190:G192)","v":"00:00:00"},{"$f":"MAX(H190:H192)","v":{"$error":"#N/A"}},{"$nulls":3},"",{"$f":"SUMIF(B$12:B$519,B189,L$12:L$519)","v":{"v":0,"d":"0.0"}}]
[{"$f":"A189","v":20000},{"$f":"B189","v":20100},{"$f":"B189+1","v":20101},null,"PL",{"$f":"OFFSET(F190,-2,0)&\" \"&OFFSET(F190,-1,0)&\" \"&INDIRECT(OFFSET(F190,-2,0)&\"!A4\")","v":"Leer Studie Projektleitung"},{"$f":"VLOOKUP(OFFSET(G190,-2,-1),Projektübersicht,3,0)","v":"00:00:00"},{"$f":"VLOOKUP(OFFSET(H190,-2,-2),Projektübersicht,4,0)","v":{"$error":"#N/A"}},{"$f":"\"Aus Top Down \"&OFFSET(I190,-2,-3)","v":"Aus Top Down Leer"},{"$f":"IF(ISNA(H190),0,1)","v":{"v":0,"d":"0.000"}},{"$f":"INDIRECT(\"'\"&OFFSET(K190,-2,-5)&\"'!B4\")","v":{"v":0,"d":"0.0"}},{"v":0,"d":"0.0"},{"$nulls":3},{"$f":"IF(ISNA($H190),0,zeitausschnitt($G190,$H190,$L190,P$9,P$10))","v":0},{"$f":"IF(ISNA($H190),0,zeitausschnitt($G190,$H190,$L190,Q$9,Q$10))","v":0},0,0,0,0,0,0,0,0,0,0,0,0,0,0,0,0,0,0,0]
[{"$f":"A190","v":20000},{"$f":"B190","v":20100},{"$f":"C190+1","v":20102},null,"Entwicklung",{"$f":"OFFSET(F191,-3,0)&\" \"&OFFSET(F191,-2,0)&\" \"&INDIRECT(OFFSET(F191,-3,0)&\"!A5\")","v":"Leer Studie Entwicklung"},{"$f":"G190","v":"00:00:00"},{"$f":"H190","v":{"$error":"#N/A"}},{"$f":"\"Aus Top Down \"&OFFSET(I191,-3,-3)","v":"Aus Top Down Leer"},{"$f":"IF(ISNA(H191),0,1)","v":{"v":0,"d":"0.000"}},{"$f":"INDIRECT(\"'\"&OFFSET(K191,-3,-5)&\"'!B5\")","v":{"v":0,"d":"0.0"}},{"v":0,"d":"0.0"},{"$nulls":3},{"$f":"IF(ISNA($H191),0,zeitausschnitt($G191,$H191,$L191,P$9,P$10))","v":0},0,0,0,0,0,0,0,0,0,0,0,0,0,0,0,0,0,0,0,0]
[20000,{"$f":"B191","v":20100},{"$f":"C191+1","v":20103},null,"Test",{"$f":"OFFSET(F192,-4,0)&\" \"&OFFSET(F192,-3,0)&\" \"&INDIRECT(OFFSET(F192,-4,0)&\"!A6\")","v":"Leer Studie Test"},{"$f":"G191","v":"00:00:00"},{"$f":"H191","v":{"$error":"#N/A"}},{"$f":"\"Aus Top Down \"&OFFSET(I192,-4,-3)","v":"Aus Top Down Leer"},{"$f":"IF(ISNA(H192),0,1)","v":{"v":0,"d":"0.000"}},{"$f":"INDIRECT(\"'\"&OFFSET(K192,-4,-5)&\"'!B6\")","v":{"v":0,"d":"0.0"}},{"v":0,"d":"0.0"},{"$nulls":3},0,0,0,0,0,0,0,0,0,0,0,0,0,0,0,0,0,0,0,0,0]
[20000,{"$nulls":10},""]
[20000,{"$f":"B189+100","v":20200},{"$nulls":3},{"$f":"INDIRECT(OFFSET(F194,-6,0)&\"!C1\")","v":"Konzept "},{"$f":"MIN(G195:G197)","v":{"$error":"#N/A"}},{"$f":"MAX(H195:H197)","v":{"$error":"#N/A"}},{"$nulls":3},"",{"$f":"SUMIF(B$12:B$519,B194,L$12:L$519)","v":{"v":0,"d":"0.0"}}]
[20000,{"$f":"B194","v":20200},{"$f":"B194+1","v":20201},null,"PL",{"$f":"OFFSET(F195,-7,0)&\" \"&OFFSET(F195,-1,0)&\" \"&INDIRECT(OFFSET(F195,-7,0)&\"!A4\")","v":"Leer Konzept  Projektleitung"},{"$f":"VLOOKUP(OFFSET(G195,-7,-1),Projektübersicht,4,0)","v":{"$error":"#N/A"}},{"$f":"VLOOKUP(OFFSET(H195,-7,-2),Projektübersicht,5,0)","v":{"$error":"#N/A"}},{"$f":"\"Aus Top Down \"&OFFSET(I195,-7,-3)","v":"Aus Top Down Leer"},{"$f":"IF(ISNA(H195),0,1)","v":{"v":0,"d":"0.000"}},{"$f":"INDIRECT(\"'\"&OFFSET(K195,-7,-5)&\"'!C4\")","v":{"v":0,"d":"0.0"}},{"v":0,"d":"0.0"},{"$nulls":3},{"$f":"IF(ISNA($H195),0,zeitausschnitt($G195,$H195,$L195,P$9,P$10))","v":0},{"$f":"IF(ISNA($H195),0,zeitausschnitt($G195,$H195,$L195,Q$9,Q$10))","v":0},0,0,0,0,0,0,0,0,0,0,0,0,0,0,0,0,0,0,0]
[20000,{"$f":"B195","v":20200},{"$f":"C195+1","v":20202},null,"Entwicklung",{"$f":"OFFSET(F196,-8,0)&\" \"&OFFSET(F196,-2,0)&\" \"&INDIRECT(OFFSET(F196,-8,0)&\"!A5\")","v":"Leer Konzept  Entwicklung"},{"$f":"G195","v":{"$error":"#N/A"}},{"$f":"H195","v":{"$error":"#N/A"}},{"$f":"\"Aus Top Down \"&OFFSET(I196,-8,-3)","v":"Aus Top Down Leer"},{"$f":"IF(ISNA(H196),0,1)","v":{"v":0,"d":"0.000"}},{"$f":"INDIRECT(\"'\"&OFFSET(K196,-8,-5)&\"'!C5\")","v":{"v":0,"d":"0.0"}},{"v":0,"d":"0.0"},{"$nulls":3},{"$f":"IF(ISNA($H196),0,zeitausschnitt($G196,$H196,$L196,P$9,P$10))","v":0},0,0,0,0,0,0,0,0,0,0,0,0,0,0,0,0,0,0,0,0]
[20000,{"$f":"B196","v":20200},{"$f":"C196+1","v":20203},null,"Test",{"$f":"OFFSET(F197,-9,0)&\" \"&OFFSET(F197,-3,0)&\" \"&INDIRECT(OFFSET(F197,-9,0)&\"!A6\")","v":"Leer Konzept  Test"},{"$f":"G196","v":{"$error":"#N/A"}},{"$f":"H196","v":{"$error":"#N/A"}},{"$f":"\"Aus Top Down \"&OFFSET(I197,-9,-3)","v":"Aus Top Down Leer"},{"$f":"IF(ISNA(H197),0,1)","v":{"v":0,"d":"0.000"}},{"$f":"INDIRECT(\"'\"&OFFSET(K197,-9,-5)&\"'!C6\")","v":{"v":0,"d":"0.0"}},{"v":0,"d":"0.0"},{"$nulls":3},0,0,0,0,0,0,0,0,0,0,0,0,0,0,0,0,0,0,0,0,0]
[20000,{"$nulls":10},""]
[20000,{"$f":"B194+100","v":20300},{"$nulls":3},{"$f":"INDIRECT(OFFSET(F199,-11,0)&\"!D1\")","v":"Entwicklung"},{"$f":"MIN(G200:G202)","v":{"$error":"#N/A"}},{"$f":"MAX(H200:H202)","v":{"$error":"#N/A"}},{"$nulls":3},"",{"$f":"SUMIF(B$12:B$519,B199,L$12:L$519)","v":{"v":0,"d":"0.0"}}]
[20000,{"$f":"B199","v":20300},{"$f":"B199+1","v":20301},null,"PL",{"$f":"OFFSET(F200,-12,0)&\" \"&OFFSET(F200,-1,0)&\" \"&INDIRECT(OFFSET(F200,-12,0)&\"!A4\")","v":"Leer Entwicklung Projektleitung"},{"$f":"VLOOKUP(OFFSET(G200,-12,-1),Projektübersicht,5,0)","v":{"$error":"#N/A"}},{"$f":"VLOOKUP(OFFSET(H200,-12,-2),Projektübersicht,6,0)","v":{"$error":"#N/A"}},{"$f":"\"Aus Top Down \"&OFFSET(I200,-12,-3)","v":"Aus Top Down Leer"},{"$f":"IF(ISNA(H200),0,1)","v":{"v":0,"d":"0.000"}},{"$f":"INDIRECT(\"'\"&OFFSET(K200,-12,-5)&\"'!D4\")","v":{"v":0,"d":"0.0"}},{"v":0,"d":"0.0"},{"$nulls":3},{"$f":"IF(ISNA($H200),0,zeitausschnitt($G200,$H200,$L200,P$9,P$10))","v":0},{"$f":"IF(ISNA($H200),0,zeitausschnitt($G200,$H200,$L200,Q$9,Q$10))","v":0},0,0,0,0,0,0,0,0,0,0,0,0,0,0,0,0,0,0,0]
[20000,{"$f":"B200","v":20300},{"$f":"C200+1","v":20302},null,"Entwicklung",{"$f":"OFFSET(F201,-13,0)&\" \"&OFFSET(F201,-2,0)&\" \"&INDIRECT(OFFSET(F201,-13,0)&\"!A5\")","v":"Leer Entwicklung Entwicklung"},{"$f":"G200","v":{"$error":"#N/A"}},{"$f":"H200","v":{"$error":"#N/A"}},{"$f":"\"Aus Top Down \"&OFFSET(I201,-13,-3)","v":"Aus Top Down Leer"},{"$f":"IF(ISNA(H201),0,1)","v":{"v":0,"d":"0.000"}},{"$f":"INDIRECT(\"'\"&OFFSET(K201,-13,-5)&\"'!D5\")","v":{"v":0,"d":"0.0"}},{"v":0,"d":"0.0"},{"$nulls":3},{"$f":"IF(ISNA($H201),0,zeitausschnitt($G201,$H201,$L201,P$9,P$10))","v":0},0,0,0,0,0,0,0,0,0,0,0,0,0,0,0,0,0,0,0,0]
[20000,{"$f":"B201","v":20300},{"$f":"C201+1","v":20303},null,"Test",{"$f":"OFFSET(F202,-14,0)&\" \"&OFFSET(F202,-3,0)&\" \"&INDIRECT(OFFSET(F202,-14,0)&\"!A6\")","v":"Leer Entwicklung Test"},{"$f":"G201","v":{"$error":"#N/A"}},{"$f":"H201","v":{"$error":"#N/A"}},{"$f":"\"Aus Top Down \"&OFFSET(I202,-14,-3)","v":"Aus Top Down Leer"},{"$f":"IF(ISNA(H202),0,1)","v":{"v":0,"d":"0.000"}},{"$f":"INDIRECT(\"'\"&OFFSET(K202,-14,-5)&\"'!D6\")","v":{"v":0,"d":"0.0"}},{"v":0,"d":"0.0"},{"$nulls":3},0,0,0,0,0,0,0,0,0,0,0,0,0,0,0,0,0,0,0,0,0]
[20000,{"$nulls":10},""]
[20000,{"$f":"B199+100","v":20400},{"$nulls":3},{"$f":"INDIRECT(OFFSET(F204,-16,0)&\"!E1\")","v":"Pflege"},{"$f":"MIN(G205:G207)","v":{"$error":"#N/A"}},{"$f":"MAX(H205:H207)","v":{"$error":"#N/A"}},{"$nulls":3},"",{"$f":"SUMIF(B$12:B$519,B204,L$12:L$519)","v":{"v":0,"d":"0.0"}}]
[20000,{"$f":"B204","v":20400},{"$f":"B204+1","v":20401},null,"PL",{"$f":"OFFSET(F205,-17,0)&\" \"&OFFSET(F205,-1,0)&\" \"&INDIRECT(OFFSET(F205,-17,0)&\"!A4\")","v":"Leer Pflege Projektleitung"},{"$f":"VLOOKUP(OFFSET(G205,-17,-1),Projektübersicht,6,0)","v":{"$error":"#N/A"}},{"$f":"VLOOKUP(OFFSET(H205,-17,-2),Projektübersicht,7,0)","v":{"$error":"#N/A"}},{"$f":"\"Aus Top Down \"&OFFSET(I205,-17,-3)","v":"Aus Top Down Leer"},{"$f":"IF(ISNA(H205),0,1)","v":{"v":0,"d":"0.000"}},{"$f":"INDIRECT(\"'\"&OFFSET(K205,-17,-5)&\"'!E4\")","v":{"v":0,"d":"0.0"}},{"v":0,"d":"0.0"},{"$nulls":3},{"$f":"IF(ISNA($H205),0,zeitausschnitt($G205,$H205,$L205,P$9,P$10))","v":0},{"$f":"IF(ISNA($H205),0,zeitausschnitt($G205,$H205,$L205,Q$9,Q$10))","v":0},0,0,0,0,0,0,0,0,0,0,0,0,0,0,0,0,0,0,0]
[20000,{"$f":"B205","v":20400},{"$f":"C205+1","v":20402},null,"Entwicklung",{"$f":"OFFSET(F206,-18,0)&\" \"&OFFSET(F206,-2,0)&\" \"&INDIRECT(OFFSET(F206,-18,0)&\"!A5\")","v":"Leer Pflege Entwicklung"},{"$f":"G205","v":{"$error":"#N/A"}},{"$f":"H205","v":{"$error":"#N/A"}},{"$f":"\"Aus Top Down \"&OFFSET(I206,-18,-3)","v":"Aus Top Down Leer"},{"$f":"IF(ISNA(H206),0,1)","v":{"v":0,"d":"0.000"}},{"$f":"INDIRECT(\"'\"&OFFSET(K206,-18,-5)&\"'!E5\")","v":{"v":0,"d":"0.0"}},{"v":0,"d":"0.0"},{"$nulls":3},{"$f":"IF(ISNA($H206),0,zeitausschnitt($G206,$H206,$L206,P$9,P$10))","v":0},0,0,0,0,0,0,0,0,0,0,0,0,0,0,0,0,0,0,0,0]
[20000,{"$f":"B206","v":20400},{"$f":"C206+1","v":20403},null,"Test",{"$f":"OFFSET(F207,-19,0)&\" \"&OFFSET(F207,-3,0)&\" \"&INDIRECT(OFFSET(F207,-19,0)&\"!A6\")","v":"Leer Pflege Test"},{"$f":"G206","v":{"$error":"#N/A"}},{"$f":"H206","v":{"$error":"#N/A"}},{"$f":"\"Aus Top Down \"&OFFSET(I207,-19,-3)","v":"Aus Top Down Leer"},{"$f":"IF(ISNA(H207),0,1)","v":{"v":0,"d":"0.000"}},{"$f":"INDIRECT(\"'\"&OFFSET(K207,-19,-5)&\"'!E6\")","v":{"v":0,"d":"0.0"}},{"v":0,"d":"0.0"},{"$nulls":3},0,0,0,0,0,0,0,0,0,0,0,0,0,0,0,0,0,0,0,0,0]
[20000,{"$nulls":10},""]
[{"$nulls":11},{"$f":"IF(AND(J209<>\"\",K209<>\"\"),J209*K209,\"\")","v":""}]
[{"$f":"A189+1000","v":21000},{"$nulls":4},{"$f":"INDIRECT(CONCATENATE(\"Übersicht!C\",TEXT((A210-10000)/1000,0)))","v":"Leer"},{"$f":"MIN(G211:G225)","v":{"$error":"#N/A"}},{"$f":"MAX(H211:H225)","v":{"$error":"#N/A"}},{"$nulls":3},"",{"$f":"SUMIF(A$12:A$519,A210,L$12:L$519)","v":{"v":0,"d":"0.0"}},null,{"$f":"F210","v":"Leer"},{"$f":"SUM(P212:P229)","v":0},{"$f":"SUM(Q212:Q229)","v":0},0,0,0,0,0,0,0,0,0,0,0,0,0,0,0,0,0,0,0]
[{"$f":"A210","v":21000},{"$f":"A210+100","v":21100},{"$nulls":3},{"$f":"INDIRECT(OFFSET(F211,-1,0)&\"!B1\")","v":"Studie"},{"$f":"MIN(G212:G214)","v":"00:00:00"},{"$f":"MAX(H212:H214)","v":{"$error":"#N/A"}},{"$nulls":3},"",{"$f":"SUMIF(B$12:B$519,B211,L$12:L$519)","v":{"v":0,"d":"0.0"}}]
[{"$f":"A211","v":21000},{"$f":"B211","v":21100},{"$f":"B211+1","v":21101},null,"PL",{"$f":"OFFSET(F212,-2,0)&\" \"&OFFSET(F212,-1,0)&\" \"&INDIRECT(OFFSET(F212,-2,0)&\"!A4\")","v":"Leer Studie Projektleitung"},{"$f":"VLOOKUP(OFFSET(G212,-2,-1),Projektübersicht,3,0)","v":"00:00:00"},{"$f":"VLOOKUP(OFFSET(H212,-2,-2),Projektübersicht,4,0)","v":{"$error":"#N/A"}},{"$f":"\"Aus Top Down \"&OFFSET(I212,-2,-3)","v":"Aus Top Down Leer"},{"$f":"IF(ISNA(H212),0,1)","v":{"v":0,"d":"0.000"}},{"$f":"INDIRECT(\"'\"&OFFSET(K212,-2,-5)&\"'!B4\")","v":{"v":0,"d":"0.0"}},{"v":0,"d":"0.0"},{"$nulls":3},{"$f":"IF(ISNA($H212),0,zeitausschnitt($G212,$H212,$L212,P$9,P$10))","v":0},{"$f":"IF(ISNA($H212),0,zeitausschnitt($G212,$H212,$L212,Q$9,Q$10))","v":0},0,0,0,0,0,0,0,0,0,0,0,0,0,0,0,0,0,0,0]
[{"$f":"A212","v":21000},{"$f":"B212","v":21100},{"$f":"C212+1","v":21102},null,"Entwicklung",{"$f":"OFFSET(F213,-3,0)&\" \"&OFFSET(F213,-2,0)&\" \"&INDIRECT(OFFSET(F213,-3,0)&\"!A5\")","v":"Leer Studie Entwicklung"},{"$f":"G212","v":"00:00:00"},{"$f":"H212","v":{"$error":"#N/A"}},{"$f":"\"Aus Top Down \"&OFFSET(I213,-3,-3)","v":"Aus Top Down Leer"},{"$f":"IF(ISNA(H213),0,1)","v":{"v":0,"d":"0.000"}},{"$f":"INDIRECT(\"'\"&OFFSET(K213,-3,-5)&\"'!B5\")","v":{"v":0,"d":"0.0"}},{"v":0,"d":"0.0"},{"$nulls":3},{"$f":"IF(ISNA($H213),0,zeitausschnitt($G213,$H213,$L213,P$9,P$10))","v":0},0,0,0,0,0,0,0,0,0,0,0,0,0,0,0,0,0,0,0,0]
[21000,{"$f":"B213","v":21100},{"$f":"C213+1","v":21103},null,"Test",{"$f":"OFFSET(F214,-4,0)&\" \"&OFFSET(F214,-3,0)&\" \"&INDIRECT(OFFSET(F214,-4,0)&\"!A6\")","v":"Leer Studie Test"},{"$f":"G213","v":"00:00:00"},{"$f":"H213","v":{"$error":"#N/A"}},{"$f":"\"Aus Top Down \"&OFFSET(I214,-4,-3)","v":"Aus Top Down Leer"},{"$f":"IF(ISNA(H214),0,1)","v":{"v":0,"d":"0.000"}},{"$f":"INDIRECT(\"'\"&OFFSET(K214,-4,-5)&\"'!B6\")","v":{"v":0,"d":"0.0"}},{"v":0,"d":"0.0"},{"$nulls":3},0,0,0,0,0,0,0,0,0,0,0,0,0,0,0,0,0,0,0,0,0]
[21000,{"$nulls":10},""]
[21000,{"$f":"B211+100","v":21200},{"$nulls":3},{"$f":"INDIRECT(OFFSET(F216,-6,0)&\"!C1\")","v":"Konzept "},{"$f":"MIN(G217:G219)","v":{"$error":"#N/A"}},{"$f":"MAX(H217:H219)","v":{"$error":"#N/A"}},{"$nulls":3},"",{"$f":"SUMIF(B$12:B$519,B216,L$12:L$519)","v":{"v":0,"d":"0.0"}}]
[21000,{"$f":"B216","v":21200},{"$f":"B216+1","v":21201},null,"PL",{"$f":"OFFSET(F217,-7,0)&\" \"&OFFSET(F217,-1,0)&\" \"&INDIRECT(OFFSET(F217,-7,0)&\"!A4\")","v":"Leer Konzept  Projektleitung"},{"$f":"VLOOKUP(OFFSET(G217,-7,-1),Projektübersicht,4,0)","v":{"$error":"#N/A"}},{"$f":"VLOOKUP(OFFSET(H217,-7,-2),Projektübersicht,5,0)","v":{"$error":"#N/A"}},{"$f":"\"Aus Top Down \"&OFFSET(I217,-7,-3)","v":"Aus Top Down Leer"},{"$f":"IF(ISNA(H217),0,1)","v":{"v":0,"d":"0.000"}},{"$f":"INDIRECT(\"'\"&OFFSET(K217,-7,-5)&\"'!C4\")","v":{"v":0,"d":"0.0"}},{"v":0,"d":"0.0"},{"$nulls":3},{"$f":"IF(ISNA($H217),0,zeitausschnitt($G217,$H217,$L217,P$9,P$10))","v":0},{"$f":"IF(ISNA($H217),0,zeitausschnitt($G217,$H217,$L217,Q$9,Q$10))","v":0},0,0,0,0,0,0,0,0,0,0,0,0,0,0,0,0,0,0,0]
[21000,{"$f":"B217","v":21200},{"$f":"C217+1","v":21202},null,"Entwicklung",{"$f":"OFFSET(F218,-8,0)&\" \"&OFFSET(F218,-2,0)&\" \"&INDIRECT(OFFSET(F218,-8,0)&\"!A5\")","v":"Leer Konzept  Entwicklung"},{"$f":"G217","v":{"$error":"#N/A"}},{"$f":"H217","v":{"$error":"#N/A"}},{"$f":"\"Aus Top Down \"&OFFSET(I218,-8,-3)","v":"Aus Top Down Leer"},{"$f":"IF(ISNA(H218),0,1)","v":{"v":0,"d":"0.000"}},{"$f":"INDIRECT(\"'\"&OFFSET(K218,-8,-5)&\"'!C5\")","v":{"v":0,"d":"0.0"}},{"v":0,"d":"0.0"},{"$nulls":3},{"$f":"IF(ISNA($H218),0,zeitausschnitt($G218,$H218,$L218,P$9,P$10))","v":0},0,0,0,0,0,0,0,0,0,0,0,0,0,0,0,0,0,0,0,0]
[21000,{"$f":"B218","v":21200},{"$f":"C218+1","v":21203},null,"Test",{"$f":"OFFSET(F219,-9,0)&\" \"&OFFSET(F219,-3,0)&\" \"&INDIRECT(OFFSET(F219,-9,0)&\"!A6\")","v":"Leer Konzept  Test"},{"$f":"G218","v":{"$error":"#N/A"}},{"$f":"H218","v":{"$error":"#N/A"}},{"$f":"\"Aus Top Down \"&OFFSET(I219,-9,-3)","v":"Aus Top Down Leer"},{"$f":"IF(ISNA(H219),0,1)","v":{"v":0,"d":"0.000"}},{"$f":"INDIRECT(\"'\"&OFFSET(K219,-9,-5)&\"'!C6\")","v":{"v":0,"d":"0.0"}},{"v":0,"d":"0.0"},{"$nulls":3},0,0,0,0,0,0,0,0,0,0,0,0,0,0,0,0,0,0,0,0,0]
[21000,{"$nulls":10},""]
[21000,{"$f":"B216+100","v":21300},{"$nulls":3},{"$f":"INDIRECT(OFFSET(F221,-11,0)&\"!D1\")","v":"Entwicklung"},{"$f":"MIN(G222:G224)","v":{"$error":"#N/A"}},{"$f":"MAX(H222:H224)","v":{"$error":"#N/A"}},{"$nulls":3},"",{"$f":"SUMIF(B$12:B$519,B221,L$12:L$519)","v":{"v":0,"d":"0.0"}}]
[21000,{"$f":"B221","v":21300},{"$f":"B221+1","v":21301},null,"PL",{"$f":"OFFSET(F222,-12,0)&\" \"&OFFSET(F222,-1,0)&\" \"&INDIRECT(OFFSET(F222,-12,0)&\"!A4\")","v":"Leer Entwicklung Projektleitung"},{"$f":"VLOOKUP(OFFSET(G222,-12,-1),Projektübersicht,5,0)","v":{"$error":"#N/A"}},{"$f":"VLOOKUP(OFFSET(H222,-12,-2),Projektübersicht,6,0)","v":{"$error":"#N/A"}},{"$f":"\"Aus Top Down \"&OFFSET(I222,-12,-3)","v":"Aus Top Down Leer"},{"$f":"IF(ISNA(H222),0,1)","v":{"v":0,"d":"0.000"}},{"$f":"INDIRECT(\"'\"&OFFSET(K222,-12,-5)&\"'!D4\")","v":{"v":0,"d":"0.0"}},{"v":0,"d":"0.0"},{"$nulls":3},{"$f":"IF(ISNA($H222),0,zeitausschnitt($G222,$H222,$L222,P$9,P$10))","v":0},{"$f":"IF(ISNA($H222),0,zeitausschnitt($G222,$H222,$L222,Q$9,Q$10))","v":0},0,0,0,0,0,0,0,0,0,0,0,0,0,0,0,0,0,0,0]
[21000,{"$f":"B222","v":21300},{"$f":"C222+1","v":21302},null,"Entwicklung",{"$f":"OFFSET(F223,-13,0)&\" \"&OFFSET(F223,-2,0)&\" \"&INDIRECT(OFFSET(F223,-13,0)&\"!A5\")","v":"Leer Entwicklung Entwicklung"},{"$f":"G222","v":{"$error":"#N/A"}},{"$f":"H222","v":{"$error":"#N/A"}},{"$f":"\"Aus Top Down \"&OFFSET(I223,-13,-3)","v":"Aus Top Down Leer"},{"$f":"IF(ISNA(H223),0,1)","v":{"v":0,"d":"0.000"}},{"$f":"INDIRECT(\"'\"&OFFSET(K223,-13,-5)&\"'!D5\")","v":{"v":0,"d":"0.0"}},{"v":0,"d":"0.0"},{"$nulls":3},{"$f":"IF(ISNA($H223),0,zeitausschnitt($G223,$H223,$L223,P$9,P$10))","v":0},0,0,0,0,0,0,0,0,0,0,0,0,0,0,0,0,0,0,0,0]
[21000,{"$f":"B223","v":21300},{"$f":"C223+1","v":21303},null,"Test",{"$f":"OFFSET(F224,-14,0)&\" \"&OFFSET(F224,-3,0)&\" \"&INDIRECT(OFFSET(F224,-14,0)&\"!A6\")","v":"Leer Entwicklung Test"},{"$f":"G223","v":{"$error":"#N/A"}},{"$f":"H223","v":{"$error":"#N/A"}},{"$f":"\"Aus Top Down \"&OFFSET(I224,-14,-3)","v":"Aus Top Down Leer"},{"$f":"IF(ISNA(H224),0,1)","v":{"v":0,"d":"0.000"}},{"$f":"INDIRECT(\"'\"&OFFSET(K224,-14,-5)&\"'!D6\")","v":{"v":0,"d":"0.0"}},{"v":0,"d":"0.0"},{"$nulls":3},0,0,0,0,0,0,0,0,0,0,0,0,0,0,0,0,0,0,0,0,0]
[21000,{"$nulls":10},""]
[21000,{"$f":"B221+100","v":21400},{"$nulls":3},{"$f":"INDIRECT(OFFSET(F226,-16,0)&\"!E1\")","v":"Pflege"},{"$f":"MIN(G227:G229)","v":{"$error":"#N/A"}},{"$f":"MAX(H227:H229)","v":{"$error":"#N/A"}},{"$nulls":3},"",{"$f":"SUMIF(B$12:B$519,B226,L$12:L$519)","v":{"v":0,"d":"0.0"}}]
[21000,{"$f":"B226","v":21400},{"$f":"B226+1","v":21401},null,"PL",{"$f":"OFFSET(F227,-17,0)&\" \"&OFFSET(F227,-1,0)&\" \"&INDIRECT(OFFSET(F227,-17,0)&\"!A4\")","v":"Leer Pflege Projektleitung"},{"$f":"VLOOKUP(OFFSET(G227,-17,-1),Projektübersicht,6,0)","v":{"$error":"#N/A"}},{"$f":"VLOOKUP(OFFSET(H227,-17,-2),Projektübersicht,7,0)","v":{"$error":"#N/A"}},{"$f":"\"Aus Top Down \"&OFFSET(I227,-17,-3)","v":"Aus Top Down Leer"},{"$f":"IF(ISNA(H227),0,1)","v":{"v":0,"d":"0.000"}},{"$f":"INDIRECT(\"'\"&OFFSET(K227,-17,-5)&\"'!E4\")","v":{"v":0,"d":"0.0"}},{"v":0,"d":"0.0"},{"$nulls":3},{"$f":"IF(ISNA($H227),0,zeitausschnitt($G227,$H227,$L227,P$9,P$10))","v":0},{"$f":"IF(ISNA($H227),0,zeitausschnitt($G227,$H227,$L227,Q$9,Q$10))","v":0},0,0,0,0,0,0,0,0,0,0,0,0,0,0,0,0,0,0,0]
[21000,{"$f":"B227","v":21400},{"$f":"C227+1","v":21402},null,"Entwicklung",{"$f":"OFFSET(F228,-18,0)&\" \"&OFFSET(F228,-2,0)&\" \"&INDIRECT(OFFSET(F228,-18,0)&\"!A5\")","v":"Leer Pflege Entwicklung"},{"$f":"G227","v":{"$error":"#N/A"}},{"$f":"H227","v":{"$error":"#N/A"}},{"$f":"\"Aus Top Down \"&OFFSET(I228,-18,-3)","v":"Aus Top Down Leer"},{"$f":"IF(ISNA(H228),0,1)","v":{"v":0,"d":"0.000"}},{"$f":"INDIRECT(\"'\"&OFFSET(K228,-18,-5)&\"'!E5\")","v":{"v":0,"d":"0.0"}},{"v":0,"d":"0.0"},{"$nulls":3},{"$f":"IF(ISNA($H228),0,zeitausschnitt($G228,$H228,$L228,P$9,P$10))","v":0},0,0,0,0,0,0,0,0,0,0,0,0,0,0,0,0,0,0,0,0]
[21000,{"$f":"B228","v":21400},{"$f":"C228+1","v":21403},null,"Test",{"$f":"OFFSET(F229,-19,0)&\" \"&OFFSET(F229,-3,0)&\" \"&INDIRECT(OFFSET(F229,-19,0)&\"!A6\")","v":"Leer Pflege Test"},{"$f":"G228","v":{"$error":"#N/A"}},{"$f":"H228","v":{"$error":"#N/A"}},{"$f":"\"Aus Top Down \"&OFFSET(I229,-19,-3)","v":"Aus Top Down Leer"},{"$f":"IF(ISNA(H229),0,1)","v":{"v":0,"d":"0.000"}},{"$f":"INDIRECT(\"'\"&OFFSET(K229,-19,-5)&\"'!E6\")","v":{"v":0,"d":"0.0"}},{"v":0,"d":"0.0"},{"$nulls":3},0,0,0,0,0,0,0,0,0,0,0,0,0,0,0,0,0,0,0,0,0]
[21000,{"$nulls":10},""]
[{"$nulls":11},""]
[{"$f":"A210+1000","v":22000},{"$nulls":4},{"$f":"INDIRECT(CONCATENATE(\"Übersicht!C\",TEXT((A232-10000)/1000,0)))","v":"Leer"},{"$f":"MIN(G233:G247)","v":{"$error":"#N/A"}},{"$f":"MAX(H233:H247)","v":{"$error":"#N/A"}},{"$nulls":3},"",{"$f":"SUMIF(A$12:A$519,A232,L$12:L$519)","v":{"v":0,"d":"0.0"}},null,{"$f":"F232","v":"Leer"},{"$f":"SUM(P234:P251)","v":0},{"$f":"SUM(Q234:Q251)","v":0},0,0,0,0,0,0,0,0,0,0,0,0,0,0,0,0,0,0,0]
[{"$f":"A232","v":22000},{"$f":"A232+100","v":22100},{"$nulls":3},{"$f":"INDIRECT(OFFSET(F233,-1,0)&\"!B1\")","v":"Studie"},{"$f":"MIN(G234:G236)","v":"00:00:00"},{"$f":"MAX(H234:H236)","v":{"$error":"#N/A"}},{"$nulls":3},"",{"$f":"SUMIF(B$12:B$519,B233,L$12:L$519)","v":{"v":0,"d":"0.0"}}]
[{"$f":"A233","v":22000},{"$f":"B233","v":22100},{"$f":"B233+1","v":22101},null,"PL",{"$f":"OFFSET(F234,-2,0)&\" \"&OFFSET(F234,-1,0)&\" \"&INDIRECT(OFFSET(F234,-2,0)&\"!A4\")","v":"Leer Studie Projektleitung"},{"$f":"VLOOKUP(OFFSET(G234,-2,-1),Projektübersicht,3,0)","v":"00:00:00"},{"$f":"VLOOKUP(OFFSET(H234,-2,-2),Projektübersicht,4,0)","v":{"$error":"#N/A"}},{"$f":"\"Aus Top Down \"&OFFSET(I234,-2,-3)","v":"Aus Top Down Leer"},{"$f":"IF(ISNA(H234),0,1)","v":{"v":0,"d":"0.000"}},{"$f":"INDIRECT(\"'\"&OFFSET(K234,-2,-5)&\"'!B4\")","v":{"v":0,"d":"0.0"}},{"v":0,"d":"0.0"},{"$nulls":3},{"$f":"IF(ISNA($H234),0,zeitausschnitt($G234,$H234,$L234,P$9,P$10))","v":0},{"$f":"IF(ISNA($H234),0,zeitausschnitt($G234,$H234,$L234,Q$9,Q$10))","v":0},0,0,0,0,0,0,0,0,0,0,0,0,0,0,0,0,0,0,0]
[{"$f":"A234","v":22000},{"$f":"B234","v":22100},{"$f":"C234+1","v":22102},null,"Entwicklung",{"$f":"OFFSET(F235,-3,0)&\" \"&OFFSET(F235,-2,0)&\" \"&INDIRECT(OFFSET(F235,-3,0)&\"!A5\")","v":"Leer Studie Entwicklung"},{"$f":"G234","v":"00:00:00"},{"$f":"H234","v":{"$error":"#N/A"}},{"$f":"\"Aus Top Down \"&OFFSET(I235,-3,-3)","v":"Aus Top Down Leer"},{"$f":"IF(ISNA(H235),0,1)","v":{"v":0,"d":"0.000"}},{"$f":"INDIRECT(\"'\"&OFFSET(K235,-3,-5)&\"'!B5\")","v":{"v":0,"d":"0.0"}},{"v":0,"d":"0.0"},{"$nulls":3},{"$f":"IF(ISNA($H235),0,zeitausschnitt($G235,$H235,$L235,P$9,P$10))","v":0},0,0,0,0,0,0,0,0,0,0,0,0,0,0,0,0,0,0,0,0]
[22000,{"$f":"B235","v":22100},{"$f":"C235+1","v":22103},null,"Test",{"$f":"OFFSET(F236,-4,0)&\" \"&OFFSET(F236,-3,0)&\" \"&INDIRECT(OFFSET(F236,-4,0)&\"!A6\")","v":"Leer Studie Test"},{"$f":"G235","v":"00:00:00"},{"$f":"H235","v":{"$error":"#N/A"}},{"$f":"\"Aus Top Down \"&OFFSET(I236,-4,-3)","v":"Aus Top Down Leer"},{"$f":"IF(ISNA(H236),0,1)","v":{"v":0,"d":"0.000"}},{"$f":"INDIRECT(\"'\"&OFFSET(K236,-4,-5)&\"'!B6\")","v":{"v":0,"d":"0.0"}},{"v":0,"d":"0.0"},{"$nulls":3},0,0,0,0,0,0,0,0,0,0,0,0,0,0,0,0,0,0,0,0,0]
[22000,{"$nulls":10},""]
[22000,{"$f":"B233+100","v":22200},{"$nulls":3},{"$f":"INDIRECT(OFFSET(F238,-6,0)&\"!C1\")","v":"Konzept "},{"$f":"MIN(G239:G241)","v":{"$error":"#N/A"}},{"$f":"MAX(H239:H241)","v":{"$error":"#N/A"}},{"$nulls":3},"",{"$f":"SUMIF(B$12:B$519,B238,L$12:L$519)","v":{"v":0,"d":"0.0"}}]
[22000,{"$f":"B238","v":22200},{"$f":"B238+1","v":22201},null,"PL",{"$f":"OFFSET(F239,-7,0)&\" \"&OFFSET(F239,-1,0)&\" \"&INDIRECT(OFFSET(F239,-7,0)&\"!A4\")","v":"Leer Konzept  Projektleitung"},{"$f":"VLOOKUP(OFFSET(G239,-7,-1),Projektübersicht,4,0)","v":{"$error":"#N/A"}},{"$f":"VLOOKUP(OFFSET(H239,-7,-2),Projektübersicht,5,0)","v":{"$error":"#N/A"}},{"$f":"\"Aus Top Down \"&OFFSET(I239,-7,-3)","v":"Aus Top Down Leer"},{"$f":"IF(ISNA(H239),0,1)","v":{"v":0,"d":"0.000"}},{"$f":"INDIRECT(\"'\"&OFFSET(K239,-7,-5)&\"'!C4\")","v":{"v":0,"d":"0.0"}},{"v":0,"d":"0.0"},{"$nulls":3},{"$f":"IF(ISNA($H239),0,zeitausschnitt($G239,$H239,$L239,P$9,P$10))","v":0},{"$f":"IF(ISNA($H239),0,zeitausschnitt($G239,$H239,$L239,Q$9,Q$10))","v":0},0,0,0,0,0,0,0,0,0,0,0,0,0,0,0,0,0,0,0]
[22000,{"$f":"B239","v":22200},{"$f":"C239+1","v":22202},null,"Entwicklung",{"$f":"OFFSET(F240,-8,0)&\" \"&OFFSET(F240,-2,0)&\" \"&INDIRECT(OFFSET(F240,-8,0)&\"!A5\")","v":"Leer Konzept  Entwicklung"},{"$f":"G239","v":{"$error":"#N/A"}},{"$f":"H239","v":{"$error":"#N/A"}},{"$f":"\"Aus Top Down \"&OFFSET(I240,-8,-3)","v":"Aus Top Down Leer"},{"$f":"IF(ISNA(H240),0,1)","v":{"v":0,"d":"0.000"}},{"$f":"INDIRECT(\"'\"&OFFSET(K240,-8,-5)&\"'!C5\")","v":{"v":0,"d":"0.0"}},{"v":0,"d":"0.0"},{"$nulls":3},{"$f":"IF(ISNA($H240),0,zeitausschnitt($G240,$H240,$L240,P$9,P$10))","v":0},0,0,0,0,0,0,0,0,0,0,0,0,0,0,0,0,0,0,0,0]
[22000,{"$f":"B240","v":22200},{"$f":"C240+1","v":22203},null,"Test",{"$f":"OFFSET(F241,-9,0)&\" \"&OFFSET(F241,-3,0)&\" \"&INDIRECT(OFFSET(F241,-9,0)&\"!A6\")","v":"Leer Konzept  Test"},{"$f":"G240","v":{"$error":"#N/A"}},{"$f":"H240","v":{"$error":"#N/A"}},{"$f":"\"Aus Top Down \"&OFFSET(I241,-9,-3)","v":"Aus Top Down Leer"},{"$f":"IF(ISNA(H241),0,1)","v":{"v":0,"d":"0.000"}},{"$f":"INDIRECT(\"'\"&OFFSET(K241,-9,-5)&\"'!C6\")","v":{"v":0,"d":"0.0"}},{"v":0,"d":"0.0"},{"$nulls":3},0,0,0,0,0,0,0,0,0,0,0,0,0,0,0,0,0,0,0,0,0]
[22000,{"$nulls":10},""]
[22000,{"$f":"B238+100","v":22300},{"$nulls":3},{"$f":"INDIRECT(OFFSET(F243,-11,0)&\"!D1\")","v":"Entwicklung"},{"$f":"MIN(G244:G246)","v":{"$error":"#N/A"}},{"$f":"MAX(H244:H246)","v":{"$error":"#N/A"}},{"$nulls":3},"",{"$f":"SUMIF(B$12:B$519,B243,L$12:L$519)","v":{"v":0,"d":"0.0"}}]
[22000,{"$f":"B243","v":22300},{"$f":"B243+1","v":22301},null,"PL",{"$f":"OFFSET(F244,-12,0)&\" \"&OFFSET(F244,-1,0)&\" \"&INDIRECT(OFFSET(F244,-12,0)&\"!A4\")","v":"Leer Entwicklung Projektleitung"},{"$f":"VLOOKUP(OFFSET(G244,-12,-1),Projektübersicht,5,0)","v":{"$error":"#N/A"}},{"$f":"VLOOKUP(OFFSET(H244,-12,-2),Projektübersicht,6,0)","v":{"$error":"#N/A"}},{"$f":"\"Aus Top Down \"&OFFSET(I244,-12,-3)","v":"Aus Top Down Leer"},{"$f":"IF(ISNA(H244),0,1)","v":{"v":0,"d":"0.000"}},{"$f":"INDIRECT(\"'\"&OFFSET(K244,-12,-5)&\"'!D4\")","v":{"v":0,"d":"0.0"}},{"v":0,"d":"0.0"},{"$nulls":3},{"$f":"IF(ISNA($H244),0,zeitausschnitt($G244,$H244,$L244,P$9,P$10))","v":0},{"$f":"IF(ISNA($H244),0,zeitausschnitt($G244,$H244,$L244,Q$9,Q$10))","v":0},0,0,0,0,0,0,0,0,0,0,0,0,0,0,0,0,0,0,0]
[22000,{"$f":"B244","v":22300},{"$f":"C244+1","v":22302},null,"Entwicklung",{"$f":"OFFSET(F245,-13,0)&\" \"&OFFSET(F245,-2,0)&\" \"&INDIRECT(OFFSET(F245,-13,0)&\"!A5\")","v":"Leer Entwicklung Entwicklung"},{"$f":"G244","v":{"$error":"#N/A"}},{"$f":"H244","v":{"$error":"#N/A"}},{"$f":"\"Aus Top Down \"&OFFSET(I245,-13,-3)","v":"Aus Top Down Leer"},{"$f":"IF(ISNA(H245),0,1)","v":{"v":0,"d":"0.000"}},{"$f":"INDIRECT(\"'\"&OFFSET(K245,-13,-5)&\"'!D5\")","v":{"v":0,"d":"0.0"}},{"v":0,"d":"0.0"},{"$nulls":3},{"$f":"IF(ISNA($H245),0,zeitausschnitt($G245,$H245,$L245,P$9,P$10))","v":0},0,0,0,0,0,0,0,0,0,0,0,0,0,0,0,0,0,0,0,0]
[22000,{"$f":"B245","v":22300},{"$f":"C245+1","v":22303},null,"Test",{"$f":"OFFSET(F246,-14,0)&\" \"&OFFSET(F246,-3,0)&\" \"&INDIRECT(OFFSET(F246,-14,0)&\"!A6\")","v":"Leer Entwicklung Test"},{"$f":"G245","v":{"$error":"#N/A"}},{"$f":"H245","v":{"$error":"#N/A"}},{"$f":"\"Aus Top Down \"&OFFSET(I246,-14,-3)","v":"Aus Top Down Leer"},{"$f":"IF(ISNA(H246),0,1)","v":{"v":0,"d":"0.000"}},{"$f":"INDIRECT(\"'\"&OFFSET(K246,-14,-5)&\"'!D6\")","v":{"v":0,"d":"0.0"}},{"v":0,"d":"0.0"},{"$nulls":3},0,0,0,0,0,0,0,0,0,0,0,0,0,0,0,0,0,0,0,0,0]
[22000,{"$nulls":10},""]
[22000,{"$f":"B243+100","v":22400},{"$nulls":3},{"$f":"INDIRECT(OFFSET(F248,-16,0)&\"!E1\")","v":"Pflege"},{"$f":"MIN(G249:G251)","v":{"$error":"#N/A"}},{"$f":"MAX(H249:H251)","v":{"$error":"#N/A"}},{"$nulls":3},"",{"$f":"SUMIF(B$12:B$519,B248,L$12:L$519)","v":{"v":0,"d":"0.0"}}]
[22000,{"$f":"B248","v":22400},{"$f":"B248+1","v":22401},null,"PL",{"$f":"OFFSET(F249,-17,0)&\" \"&OFFSET(F249,-1,0)&\" \"&INDIRECT(OFFSET(F249,-17,0)&\"!A4\")","v":"Leer Pflege Projektleitung"},{"$f":"VLOOKUP(OFFSET(G249,-17,-1),Projektübersicht,6,0)","v":{"$error":"#N/A"}},{"$f":"VLOOKUP(OFFSET(H249,-17,-2),Projektübersicht,7,0)","v":{"$error":"#N/A"}},{"$f":"\"Aus Top Down \"&OFFSET(I249,-17,-3)","v":"Aus Top Down Leer"},{"$f":"IF(ISNA(H249),0,1)","v":{"v":0,"d":"0.000"}},{"$f":"INDIRECT(\"'\"&OFFSET(K249,-17,-5)&\"'!E4\")","v":{"v":0,"d":"0.0"}},{"v":0,"d":"0.0"},{"$nulls":3},{"$f":"IF(ISNA($H249),0,zeitausschnitt($G249,$H249,$L249,P$9,P$10))","v":0},{"$f":"IF(ISNA($H249),0,zeitausschnitt($G249,$H249,$L249,Q$9,Q$10))","v":0},0,0,0,0,0,0,0,0,0,0,0,0,0,0,0,0,0,0,0]
[22000,{"$f":"B249","v":22400},{"$f":"C249+1","v":22402},null,"Entwicklung",{"$f":"OFFSET(F250,-18,0)&\" \"&OFFSET(F250,-2,0)&\" \"&INDIRECT(OFFSET(F250,-18,0)&\"!A5\")","v":"Leer Pflege Entwicklung"},{"$f":"G249","v":{"$error":"#N/A"}},{"$f":"H249","v":{"$error":"#N/A"}},{"$f":"\"Aus Top Down \"&OFFSET(I250,-18,-3)","v":"Aus Top Down Leer"},{"$f":"IF(ISNA(H250),0,1)","v":{"v":0,"d":"0.000"}},{"$f":"INDIRECT(\"'\"&OFFSET(K250,-18,-5)&\"'!E5\")","v":{"v":0,"d":"0.0"}},{"v":0,"d":"0.0"},{"$nulls":3},{"$f":"IF(ISNA($H250),0,zeitausschnitt($G250,$H250,$L250,P$9,P$10))","v":0},0,0,0,0,0,0,0,0,0,0,0,0,0,0,0,0,0,0,0,0]
[22000,{"$f":"B250","v":22400},{"$f":"C250+1","v":22403},null,"Test",{"$f":"OFFSET(F251,-19,0)&\" \"&OFFSET(F251,-3,0)&\" \"&INDIRECT(OFFSET(F251,-19,0)&\"!A6\")","v":"Leer Pflege Test"},{"$f":"G250","v":{"$error":"#N/A"}},{"$f":"H250","v":{"$error":"#N/A"}},{"$f":"\"Aus Top Down \"&OFFSET(I251,-19,-3)","v":"Aus Top Down Leer"},{"$f":"IF(ISNA(H251),0,1)","v":{"v":0,"d":"0.000"}},{"$f":"INDIRECT(\"'\"&OFFSET(K251,-19,-5)&\"'!E6\")","v":{"v":0,"d":"0.0"}},{"v":0,"d":"0.0"},{"$nulls":3},0,0,0,0,0,0,0,0,0,0,0,0,0,0,0,0,0,0,0,0,0]
[22000,{"$nulls":10},""]
[{"$nulls":11},{"$f":"IF(AND(J253<>\"\",K253<>\"\"),J253*K253,\"\")","v":""}]
[{"$f":"A233+1000","v":23000},{"$nulls":4},{"$f":"INDIRECT(CONCATENATE(\"Übersicht!C\",TEXT((A254-10000)/1000,0)))","v":"Leer"},{"$f":"MIN(G255:G269)","v":{"$error":"#N/A"}},{"$f":"MAX(H255:H269)","v":{"$error":"#N/A"}},{"$nulls":3},"",{"$f":"SUMIF(A$12:A$519,A254,L$12:L$519)","v":{"v":0,"d":"0.0"}},null,{"$f":"F254","v":"Leer"},{"$f":"SUM(P256:P273)","v":0},{"$f":"SUM(Q256:Q273)","v":0},0,0,0,0,0,0,0,0,0,0,0,0,0,0,0,0,0,0,0]
[{"$f":"A254","v":23000},{"$f":"A254+100","v":23100},{"$nulls":3},{"$f":"INDIRECT(OFFSET(F255,-1,0)&\"!B1\")","v":"Studie"},{"$f":"MIN(G256:G258)","v":"00:00:00"},{"$f":"MAX(H256:H258)","v":{"$error":"#N/A"}},{"$nulls":3},"",{"$f":"SUMIF(B$12:B$519,B255,L$12:L$519)","v":{"v":0,"d":"0.0"}}]
[{"$f":"A255","v":23000},{"$f":"B255","v":23100},{"$f":"B255+1","v":23101},null,"PL",{"$f":"OFFSET(F256,-2,0)&\" \"&OFFSET(F256,-1,0)&\" \"&INDIRECT(OFFSET(F256,-2,0)&\"!A4\")","v":"Leer Studie Projektleitung"},{"$f":"VLOOKUP(OFFSET(G256,-2,-1),Projektübersicht,3,0)","v":"00:00:00"},{"$f":"VLOOKUP(OFFSET(H256,-2,-2),Projektübersicht,4,0)","v":{"$error":"#N/A"}},{"$f":"\"Aus Top Down \"&OFFSET(I256,-2,-3)","v":"Aus Top Down Leer"},{"$f":"IF(ISNA(H256),0,1)","v":{"v":0,"d":"0.000"}},{"$f":"INDIRECT(\"'\"&OFFSET(K256,-2,-5)&\"'!B4\")","v":{"v":0,"d":"0.0"}},{"v":0,"d":"0.0"},{"$nulls":3},{"$f":"IF(ISNA($H256),0,zeitausschnitt($G256,$H256,$L256,P$9,P$10))","v":0},{"$f":"IF(ISNA($H256),0,zeitausschnitt($G256,$H256,$L256,Q$9,Q$10))","v":0},0,0,0,0,0,0,0,0,0,0,0,0,0,0,0,0,0,0,0]
[{"$f":"A256","v":23000},{"$f":"B256","v":23100},{"$f":"C256+1","v":23102},null,"Entwicklung",{"$f":"OFFSET(F257,-3,0)&\" \"&OFFSET(F257,-2,0)&\" \"&INDIRECT(OFFSET(F257,-3,0)&\"!A5\")","v":"Leer Studie Entwicklung"},{"$f":"G256","v":"00:00:00"},{"$f":"H256","v":{"$error":"#N/A"}},{"$f":"\"Aus Top Down \"&OFFSET(I257,-3,-3)","v":"Aus Top Down Leer"},{"$f":"IF(ISNA(H257),0,1)","v":{"v":0,"d":"0.000"}},{"$f":"INDIRECT(\"'\"&OFFSET(K257,-3,-5)&\"'!B5\")","v":{"v":0,"d":"0.0"}},{"v":0,"d":"0.0"},{"$nulls":3},{"$f":"IF(ISNA($H257),0,zeitausschnitt($G257,$H257,$L257,P$9,P$10))","v":0},0,0,0,0,0,0,0,0,0,0,0,0,0,0,0,0,0,0,0,0]
[23000,{"$f":"B257","v":23100},{"$f":"C257+1","v":23103},null,"Test",{"$f":"OFFSET(F258,-4,0)&\" \"&OFFSET(F258,-3,0)&\" \"&INDIRECT(OFFSET(F258,-4,0)&\"!A6\")","v":"Leer Studie Test"},{"$f":"G257","v":"00:00:00"},{"$f":"H257","v":{"$error":"#N/A"}},{"$f":"\"Aus Top Down \"&OFFSET(I258,-4,-3)","v":"Aus Top Down Leer"},{"$f":"IF(ISNA(H258),0,1)","v":{"v":0,"d":"0.000"}},{"$f":"INDIRECT(\"'\"&OFFSET(K258,-4,-5)&\"'!B6\")","v":{"v":0,"d":"0.0"}},{"v":0,"d":"0.0"},{"$nulls":3},0,0,0,0,0,0,0,0,0,0,0,0,0,0,0,0,0,0,0,0,0]
[23000,{"$nulls":10},""]
[23000,{"$f":"B255+100","v":23200},{"$nulls":3},{"$f":"INDIRECT(OFFSET(F260,-6,0)&\"!C1\")","v":"Konzept "},{"$f":"MIN(G261:G263)","v":{"$error":"#N/A"}},{"$f":"MAX(H261:H263)","v":{"$error":"#N/A"}},{"$nulls":3},"",{"$f":"SUMIF(B$12:B$519,B260,L$12:L$519)","v":{"v":0,"d":"0.0"}}]
[23000,{"$f":"B260","v":23200},{"$f":"B260+1","v":23201},null,"PL",{"$f":"OFFSET(F261,-7,0)&\" \"&OFFSET(F261,-1,0)&\" \"&INDIRECT(OFFSET(F261,-7,0)&\"!A4\")","v":"Leer Konzept  Projektleitung"},{"$f":"VLOOKUP(OFFSET(G261,-7,-1),Projektübersicht,4,0)","v":{"$error":"#N/A"}},{"$f":"VLOOKUP(OFFSET(H261,-7,-2),Projektübersicht,5,0)","v":{"$error":"#N/A"}},{"$f":"\"Aus Top Down \"&OFFSET(I261,-7,-3)","v":"Aus Top Down Leer"},{"$f":"IF(ISNA(H261),0,1)","v":{"v":0,"d":"0.000"}},{"$f":"INDIRECT(\"'\"&OFFSET(K261,-7,-5)&\"'!C4\")","v":{"v":0,"d":"0.0"}},{"v":0,"d":"0.0"},{"$nulls":3},{"$f":"IF(ISNA($H261),0,zeitausschnitt($G261,$H261,$L261,P$9,P$10))","v":0},{"$f":"IF(ISNA($H261),0,zeitausschnitt($G261,$H261,$L261,Q$9,Q$10))","v":0},0,0,0,0,0,0,0,0,0,0,0,0,0,0,0,0,0,0,0]
[23000,{"$f":"B261","v":23200},{"$f":"C261+1","v":23202},null,"Entwicklung",{"$f":"OFFSET(F262,-8,0)&\" \"&OFFSET(F262,-2,0)&\" \"&INDIRECT(OFFSET(F262,-8,0)&\"!A5\")","v":"Leer Konzept  Entwicklung"},{"$f":"G261","v":{"$error":"#N/A"}},{"$f":"H261","v":{"$error":"#N/A"}},{"$f":"\"Aus Top Down \"&OFFSET(I262,-8,-3)","v":"Aus Top Down Leer"},{"$f":"IF(ISNA(H262),0,1)","v":{"v":0,"d":"0.000"}},{"$f":"INDIRECT(\"'\"&OFFSET(K262,-8,-5)&\"'!C5\")","v":{"v":0,"d":"0.0"}},{"v":0,"d":"0.0"},{"$nulls":3},{"$f":"IF(ISNA($H262),0,zeitausschnitt($G262,$H262,$L262,P$9,P$10))","v":0},0,0,0,0,0,0,0,0,0,0,0,0,0,0,0,0,0,0,0,0]
[23000,{"$f":"B262","v":23200},{"$f":"C262+1","v":23203},null,"Test",{"$f":"OFFSET(F263,-9,0)&\" \"&OFFSET(F263,-3,0)&\" \"&INDIRECT(OFFSET(F263,-9,0)&\"!A6\")","v":"Leer Konzept  Test"},{"$f":"G262","v":{"$error":"#N/A"}},{"$f":"H262","v":{"$error":"#N/A"}},{"$f":"\"Aus Top Down \"&OFFSET(I263,-9,-3)","v":"Aus Top Down Leer"},{"$f":"IF(ISNA(H263),0,1)","v":{"v":0,"d":"0.000"}},{"$f":"INDIRECT(\"'\"&OFFSET(K263,-9,-5)&\"'!C6\")","v":{"v":0,"d":"0.0"}},{"v":0,"d":"0.0"},{"$nulls":3},0,0,0,0,0,0,0,0,0,0,0,0,0,0,0,0,0,0,0,0,0]
[23000,{"$nulls":10},""]
[23000,{"$f":"B260+100","v":23300},{"$nulls":3},{"$f":"INDIRECT(OFFSET(F265,-11,0)&\"!D1\")","v":"Entwicklung"},{"$f":"MIN(G266:G268)","v":{"$error":"#N/A"}},{"$f":"MAX(H266:H268)","v":{"$error":"#N/A"}},{"$nulls":3},"",{"$f":"SUMIF(B$12:B$519,B265,L$12:L$519)","v":{"v":0,"d":"0.0"}}]
[23000,{"$f":"B265","v":23300},{"$f":"B265+1","v":23301},null,"PL",{"$f":"OFFSET(F266,-12,0)&\" \"&OFFSET(F266,-1,0)&\" \"&INDIRECT(OFFSET(F266,-12,0)&\"!A4\")","v":"Leer Entwicklung Projektleitung"},{"$f":"VLOOKUP(OFFSET(G266,-12,-1),Projektübersicht,5,0)","v":{"$error":"#N/A"}},{"$f":"VLOOKUP(OFFSET(H266,-12,-2),Projektübersicht,6,0)","v":{"$error":"#N/A"}},{"$f":"\"Aus Top Down \"&OFFSET(I266,-12,-3)","v":"Aus Top Down Leer"},{"$f":"IF(ISNA(H266),0,1)","v":{"v":0,"d":"0.000"}},{"$f":"INDIRECT(\"'\"&OFFSET(K266,-12,-5)&\"'!D4\")","v":{"v":0,"d":"0.0"}},{"v":0,"d":"0.0"},{"$nulls":3},{"$f":"IF(ISNA($H266),0,zeitausschnitt($G266,$H266,$L266,P$9,P$10))","v":0},{"$f":"IF(ISNA($H266),0,zeitausschnitt($G266,$H266,$L266,Q$9,Q$10))","v":0},0,0,0,0,0,0,0,0,0,0,0,0,0,0,0,0,0,0,0]
[23000,{"$f":"B266","v":23300},{"$f":"C266+1","v":23302},null,"Entwicklung",{"$f":"OFFSET(F267,-13,0)&\" \"&OFFSET(F267,-2,0)&\" \"&INDIRECT(OFFSET(F267,-13,0)&\"!A5\")","v":"Leer Entwicklung Entwicklung"},{"$f":"G266","v":{"$error":"#N/A"}},{"$f":"H266","v":{"$error":"#N/A"}},{"$f":"\"Aus Top Down \"&OFFSET(I267,-13,-3)","v":"Aus Top Down Leer"},{"$f":"IF(ISNA(H267),0,1)","v":{"v":0,"d":"0.000"}},{"$f":"INDIRECT(\"'\"&OFFSET(K267,-13,-5)&\"'!D5\")","v":{"v":0,"d":"0.0"}},{"v":0,"d":"0.0"},{"$nulls":3},{"$f":"IF(ISNA($H267),0,zeitausschnitt($G267,$H267,$L267,P$9,P$10))","v":0},0,0,0,0,0,0,0,0,0,0,0,0,0,0,0,0,0,0,0,0]
[23000,{"$f":"B267","v":23300},{"$f":"C267+1","v":23303},null,"Test",{"$f":"OFFSET(F268,-14,0)&\" \"&OFFSET(F268,-3,0)&\" \"&INDIRECT(OFFSET(F268,-14,0)&\"!A6\")","v":"Leer Entwicklung Test"},{"$f":"G267","v":{"$error":"#N/A"}},{"$f":"H267","v":{"$error":"#N/A"}},{"$f":"\"Aus Top Down \"&OFFSET(I268,-14,-3)","v":"Aus Top Down Leer"},{"$f":"IF(ISNA(H268),0,1)","v":{"v":0,"d":"0.000"}},{"$f":"INDIRECT(\"'\"&OFFSET(K268,-14,-5)&\"'!D6\")","v":{"v":0,"d":"0.0"}},{"v":0,"d":"0.0"},{"$nulls":3},0,0,0,0,0,0,0,0,0,0,0,0,0,0,0,0,0,0,0,0,0]
[23000,{"$nulls":10},""]
[23000,{"$f":"B265+100","v":23400},{"$nulls":3},{"$f":"INDIRECT(OFFSET(F270,-16,0)&\"!E1\")","v":"Pflege"},{"$f":"MIN(G271:G273)","v":{"$error":"#N/A"}},{"$f":"MAX(H271:H273)","v":{"$error":"#N/A"}},{"$nulls":3},"",{"$f":"SUMIF(B$12:B$519,B270,L$12:L$519)","v":{"v":0,"d":"0.0"}}]
[23000,{"$f":"B270","v":23400},{"$f":"B270+1","v":23401},null,"PL",{"$f":"OFFSET(F271,-17,0)&\" \"&OFFSET(F271,-1,0)&\" \"&INDIRECT(OFFSET(F271,-17,0)&\"!A4\")","v":"Leer Pflege Projektleitung"},{"$f":"VLOOKUP(OFFSET(G271,-17,-1),Projektübersicht,6,0)","v":{"$error":"#N/A"}},{"$f":"VLOOKUP(OFFSET(H271,-17,-2),Projektübersicht,7,0)","v":{"$error":"#N/A"}},{"$f":"\"Aus Top Down \"&OFFSET(I271,-17,-3)","v":"Aus Top Down Leer"},{"$f":"IF(ISNA(H271),0,1)","v":{"v":0,"d":"0.000"}},{"$f":"INDIRECT(\"'\"&OFFSET(K271,-17,-5)&\"'!E4\")","v":{"v":0,"d":"0.0"}},{"v":0,"d":"0.0"},{"$nulls":3},{"$f":"IF(ISNA($H271),0,zeitausschnitt($G271,$H271,$L271,P$9,P$10))","v":0},{"$f":"IF(ISNA($H271),0,zeitausschnitt($G271,$H271,$L271,Q$9,Q$10))","v":0},0,0,0,0,0,0,0,0,0,0,0,0,0,0,0,0,0,0,0]
[23000,{"$f":"B271","v":23400},{"$f":"C271+1","v":23402},null,"Entwicklung",{"$f":"OFFSET(F272,-18,0)&\" \"&OFFSET(F272,-2,0)&\" \"&INDIRECT(OFFSET(F272,-18,0)&\"!A5\")","v":"Leer Pflege Entwicklung"},{"$f":"G271","v":{"$error":"#N/A"}},{"$f":"H271","v":{"$error":"#N/A"}},{"$f":"\"Aus Top Down \"&OFFSET(I272,-18,-3)","v":"Aus Top Down Leer"},{"$f":"IF(ISNA(H272),0,1)","v":{"v":0,"d":"0.000"}},{"$f":"INDIRECT(\"'\"&OFFSET(K272,-18,-5)&\"'!E5\")","v":{"v":0,"d":"0.0"}},{"v":0,"d":"0.0"},{"$nulls":3},{"$f":"IF(ISNA($H272),0,zeitausschnitt($G272,$H272,$L272,P$9,P$10))","v":0},0,0,0,0,0,0,0,0,0,0,0,0,0,0,0,0,0,0,0,0]
[23000,{"$f":"B272","v":23400},{"$f":"C272+1","v":23403},null,"Test",{"$f":"OFFSET(F273,-19,0)&\" \"&OFFSET(F273,-3,0)&\" \"&INDIRECT(OFFSET(F273,-19,0)&\"!A6\")","v":"Leer Pflege Test"},{"$f":"G272","v":{"$error":"#N/A"}},{"$f":"H272","v":{"$error":"#N/A"}},{"$f":"\"Aus Top Down \"&OFFSET(I273,-19,-3)","v":"Aus Top Down Leer"},{"$f":"IF(ISNA(H273),0,1)","v":{"v":0,"d":"0.000"}},{"$f":"INDIRECT(\"'\"&OFFSET(K273,-19,-5)&\"'!E6\")","v":{"v":0,"d":"0.0"}},{"v":0,"d":"0.0"},{"$nulls":3},0,0,0,0,0,0,0,0,0,0,0,0,0,0,0,0,0,0,0,0,0]
[23000,{"$nulls":10},""]
[{"$nulls":11},""]
[{"$f":"A254+1000","v":24000},{"$nulls":4},{"$f":"INDIRECT(CONCATENATE(\"Übersicht!C\",TEXT((A276-10000)/1000,0)))","v":"Leer"},{"$f":"MIN(G277:G291)","v":{"$error":"#N/A"}},{"$f":"MAX(H277:H291)","v":{"$error":"#N/A"}},{"$nulls":3},"",{"$f":"SUMIF(A$12:A$519,A276,L$12:L$519)","v":{"v":0,"d":"0.0"}},null,{"$f":"F276","v":"Leer"},{"$f":"SUM(P278:P295)","v":0},{"$f":"SUM(Q278:Q295)","v":0},0,0,0,0,0,0,0,0,0,0,0,0,0,0,0,0,0,0,0]
[{"$f":"A276","v":24000},{"$f":"A276+100","v":24100},{"$nulls":3},{"$f":"INDIRECT(OFFSET(F277,-1,0)&\"!B1\")","v":"Studie"},{"$f":"MIN(G278:G280)","v":"00:00:00"},{"$f":"MAX(H278:H280)","v":{"$error":"#N/A"}},{"$nulls":3},"",{"$f":"SUMIF(B$12:B$519,B277,L$12:L$519)","v":{"v":0,"d":"0.0"}}]
[{"$f":"A277","v":24000},{"$f":"B277","v":24100},{"$f":"B277+1","v":24101},null,"PL",{"$f":"OFFSET(F278,-2,0)&\" \"&OFFSET(F278,-1,0)&\" \"&INDIRECT(OFFSET(F278,-2,0)&\"!A4\")","v":"Leer Studie Projektleitung"},{"$f":"VLOOKUP(OFFSET(G278,-2,-1),Projektübersicht,3,0)","v":"00:00:00"},{"$f":"VLOOKUP(OFFSET(H278,-2,-2),Projektübersicht,4,0)","v":{"$error":"#N/A"}},{"$f":"\"Aus Top Down \"&OFFSET(I278,-2,-3)","v":"Aus Top Down Leer"},{"$f":"IF(ISNA(H278),0,1)","v":{"v":0,"d":"0.000"}},{"$f":"INDIRECT(\"'\"&OFFSET(K278,-2,-5)&\"'!B4\")","v":{"v":0,"d":"0.0"}},{"v":0,"d":"0.0"},{"$nulls":3},{"$f":"IF(ISNA($H278),0,zeitausschnitt($G278,$H278,$L278,P$9,P$10))","v":0},{"$f":"IF(ISNA($H278),0,zeitausschnitt($G278,$H278,$L278,Q$9,Q$10))","v":0},0,0,0,0,0,0,0,0,0,0,0,0,0,0,0,0,0,0,0]
[{"$f":"A278","v":24000},{"$f":"B278","v":24100},{"$f":"C278+1","v":24102},null,"Entwicklung",{"$f":"OFFSET(F279,-3,0)&\" \"&OFFSET(F279,-2,0)&\" \"&INDIRECT(OFFSET(F279,-3,0)&\"!A5\")","v":"Leer Studie Entwicklung"},{"$f":"G278","v":"00:00:00"},{"$f":"H278","v":{"$error":"#N/A"}},{"$f":"\"Aus Top Down \"&OFFSET(I279,-3,-3)","v":"Aus Top Down Leer"},{"$f":"IF(ISNA(H279),0,1)","v":{"v":0,"d":"0.000"}},{"$f":"INDIRECT(\"'\"&OFFSET(K279,-3,-5)&\"'!B5\")","v":{"v":0,"d":"0.0"}},{"v":0,"d":"0.0"},{"$nulls":3},{"$f":"IF(ISNA($H279),0,zeitausschnitt($G279,$H279,$L279,P$9,P$10))","v":0},0,0,0,0,0,0,0,0,0,0,0,0,0,0,0,0,0,0,0,0]
[24000,{"$f":"B279","v":24100},{"$f":"C279+1","v":24103},null,"Test",{"$f":"OFFSET(F280,-4,0)&\" \"&OFFSET(F280,-3,0)&\" \"&INDIRECT(OFFSET(F280,-4,0)&\"!A6\")","v":"Leer Studie Test"},{"$f":"G279","v":"00:00:00"},{"$f":"H279","v":{"$error":"#N/A"}},{"$f":"\"Aus Top Down \"&OFFSET(I280,-4,-3)","v":"Aus Top Down Leer"},{"$f":"IF(ISNA(H280),0,1)","v":{"v":0,"d":"0.000"}},{"$f":"INDIRECT(\"'\"&OFFSET(K280,-4,-5)&\"'!B6\")","v":{"v":0,"d":"0.0"}},{"v":0,"d":"0.0"},{"$nulls":3},0,0,0,0,0,0,0,0,0,0,0,0,0,0,0,0,0,0,0,0,0]
[24000,{"$nulls":10},""]
[24000,{"$f":"B277+100","v":24200},{"$nulls":3},{"$f":"INDIRECT(OFFSET(F282,-6,0)&\"!C1\")","v":"Konzept "},{"$f":"MIN(G283:G285)","v":{"$error":"#N/A"}},{"$f":"MAX(H283:H285)","v":{"$error":"#N/A"}},{"$nulls":3},"",{"$f":"SUMIF(B$12:B$519,B282,L$12:L$519)","v":{"v":0,"d":"0.0"}}]
[24000,{"$f":"B282","v":24200},{"$f":"B282+1","v":24201},null,"PL",{"$f":"OFFSET(F283,-7,0)&\" \"&OFFSET(F283,-1,0)&\" \"&INDIRECT(OFFSET(F283,-7,0)&\"!A4\")","v":"Leer Konzept  Projektleitung"},{"$f":"VLOOKUP(OFFSET(G283,-7,-1),Projektübersicht,4,0)","v":{"$error":"#N/A"}},{"$f":"VLOOKUP(OFFSET(H283,-7,-2),Projektübersicht,5,0)","v":{"$error":"#N/A"}},{"$f":"\"Aus Top Down \"&OFFSET(I283,-7,-3)","v":"Aus Top Down Leer"},{"$f":"IF(ISNA(H283),0,1)","v":{"v":0,"d":"0.000"}},{"$f":"INDIRECT(\"'\"&OFFSET(K283,-7,-5)&\"'!C4\")","v":{"v":0,"d":"0.0"}},{"v":0,"d":"0.0"},{"$nulls":3},{"$f":"IF(ISNA($H283),0,zeitausschnitt($G283,$H283,$L283,P$9,P$10))","v":0},{"$f":"IF(ISNA($H283),0,zeitausschnitt($G283,$H283,$L283,Q$9,Q$10))","v":0},0,0,0,0,0,0,0,0,0,0,0,0,0,0,0,0,0,0,0]
[24000,{"$f":"B283","v":24200},{"$f":"C283+1","v":24202},null,"Entwicklung",{"$f":"OFFSET(F284,-8,0)&\" \"&OFFSET(F284,-2,0)&\" \"&INDIRECT(OFFSET(F284,-8,0)&\"!A5\")","v":"Leer Konzept  Entwicklung"},{"$f":"G283","v":{"$error":"#N/A"}},{"$f":"H283","v":{"$error":"#N/A"}},{"$f":"\"Aus Top Down \"&OFFSET(I284,-8,-3)","v":"Aus Top Down Leer"},{"$f":"IF(ISNA(H284),0,1)","v":{"v":0,"d":"0.000"}},{"$f":"INDIRECT(\"'\"&OFFSET(K284,-8,-5)&\"'!C5\")","v":{"v":0,"d":"0.0"}},{"v":0,"d":"0.0"},{"$nulls":3},{"$f":"IF(ISNA($H284),0,zeitausschnitt($G284,$H284,$L284,P$9,P$10))","v":0},0,0,0,0,0,0,0,0,0,0,0,0,0,0,0,0,0,0,0,0]
[24000,{"$f":"B284","v":24200},{"$f":"C284+1","v":24203},null,"Test",{"$f":"OFFSET(F285,-9,0)&\" \"&OFFSET(F285,-3,0)&\" \"&INDIRECT(OFFSET(F285,-9,0)&\"!A6\")","v":"Leer Konzept  Test"},{"$f":"G284","v":{"$error":"#N/A"}},{"$f":"H284","v":{"$error":"#N/A"}},{"$f":"\"Aus Top Down \"&OFFSET(I285,-9,-3)","v":"Aus Top Down Leer"},{"$f":"IF(ISNA(H285),0,1)","v":{"v":0,"d":"0.000"}},{"$f":"INDIRECT(\"'\"&OFFSET(K285,-9,-5)&\"'!C6\")","v":{"v":0,"d":"0.0"}},{"v":0,"d":"0.0"},{"$nulls":3},0,0,0,0,0,0,0,0,0,0,0,0,0,0,0,0,0,0,0,0,0]
[24000,{"$nulls":10},""]
[24000,{"$f":"B282+100","v":24300},{"$nulls":3},{"$f":"INDIRECT(OFFSET(F287,-11,0)&\"!D1\")","v":"Entwicklung"},{"$f":"MIN(G288:G290)","v":{"$error":"#N/A"}},{"$f":"MAX(H288:H290)","v":{"$error":"#N/A"}},{"$nulls":3},"",{"$f":"SUMIF(B$12:B$519,B287,L$12:L$519)","v":{"v":0,"d":"0.0"}}]
[24000,{"$f":"B287","v":24300},{"$f":"B287+1","v":24301},null,"PL",{"$f":"OFFSET(F288,-12,0)&\" \"&OFFSET(F288,-1,0)&\" \"&INDIRECT(OFFSET(F288,-12,0)&\"!A4\")","v":"Leer Entwicklung Projektleitung"},{"$f":"VLOOKUP(OFFSET(G288,-12,-1),Projektübersicht,5,0)","v":{"$error":"#N/A"}},{"$f":"VLOOKUP(OFFSET(H288,-12,-2),Projektübersicht,6,0)","v":{"$error":"#N/A"}},{"$f":"\"Aus Top Down \"&OFFSET(I288,-12,-3)","v":"Aus Top Down Leer"},{"$f":"IF(ISNA(H288),0,1)","v":{"v":0,"d":"0.000"}},{"$f":"INDIRECT(\"'\"&OFFSET(K288,-12,-5)&\"'!D4\")","v":{"v":0,"d":"0.0"}},{"v":0,"d":"0.0"},{"$nulls":3},{"$f":"IF(ISNA($H288),0,zeitausschnitt($G288,$H288,$L288,P$9,P$10))","v":0},{"$f":"IF(ISNA($H288),0,zeitausschnitt($G288,$H288,$L288,Q$9,Q$10))","v":0},0,0,0,0,0,0,0,0,0,0,0,0,0,0,0,0,0,0,0]
[24000,{"$f":"B288","v":24300},{"$f":"C288+1","v":24302},null,"Entwicklung",{"$f":"OFFSET(F289,-13,0)&\" \"&OFFSET(F289,-2,0)&\" \"&INDIRECT(OFFSET(F289,-13,0)&\"!A5\")","v":"Leer Entwicklung Entwicklung"},{"$f":"G288","v":{"$error":"#N/A"}},{"$f":"H288","v":{"$error":"#N/A"}},{"$f":"\"Aus Top Down \"&OFFSET(I289,-13,-3)","v":"Aus Top Down Leer"},{"$f":"IF(ISNA(H289),0,1)","v":{"v":0,"d":"0.000"}},{"$f":"INDIRECT(\"'\"&OFFSET(K289,-13,-5)&\"'!D5\")","v":{"v":0,"d":"0.0"}},{"v":0,"d":"0.0"},{"$nulls":3},{"$f":"IF(ISNA($H289),0,zeitausschnitt($G289,$H289,$L289,P$9,P$10))","v":0},0,0,0,0,0,0,0,0,0,0,0,0,0,0,0,0,0,0,0,0]
[24000,{"$f":"B289","v":24300},{"$f":"C289+1","v":24303},null,"Test",{"$f":"OFFSET(F290,-14,0)&\" \"&OFFSET(F290,-3,0)&\" \"&INDIRECT(OFFSET(F290,-14,0)&\"!A6\")","v":"Leer Entwicklung Test"},{"$f":"G289","v":{"$error":"#N/A"}},{"$f":"H289","v":{"$error":"#N/A"}},{"$f":"\"Aus Top Down \"&OFFSET(I290,-14,-3)","v":"Aus Top Down Leer"},{"$f":"IF(ISNA(H290),0,1)","v":{"v":0,"d":"0.000"}},{"$f":"INDIRECT(\"'\"&OFFSET(K290,-14,-5)&\"'!D6\")","v":{"v":0,"d":"0.0"}},{"v":0,"d":"0.0"},{"$nulls":3},0,0,0,0,0,0,0,0,0,0,0,0,0,0,0,0,0,0,0,0,0]
[24000,{"$nulls":10},""]
[24000,{"$f":"B287+100","v":24400},{"$nulls":3},{"$f":"INDIRECT(OFFSET(F292,-16,0)&\"!E1\")","v":"Pflege"},{"$f":"MIN(G293:G295)","v":{"$error":"#N/A"}},{"$f":"MAX(H293:H295)","v":{"$error":"#N/A"}},{"$nulls":3},"",{"$f":"SUMIF(B$12:B$519,B292,L$12:L$519)","v":{"v":0,"d":"0.0"}}]
[24000,{"$f":"B292","v":24400},{"$f":"B292+1","v":24401},null,"PL",{"$f":"OFFSET(F293,-17,0)&\" \"&OFFSET(F293,-1,0)&\" \"&INDIRECT(OFFSET(F293,-17,0)&\"!A4\")","v":"Leer Pflege Projektleitung"},{"$f":"VLOOKUP(OFFSET(G293,-17,-1),Projektübersicht,6,0)","v":{"$error":"#N/A"}},{"$f":"VLOOKUP(OFFSET(H293,-17,-2),Projektübersicht,7,0)","v":{"$error":"#N/A"}},{"$f":"\"Aus Top Down \"&OFFSET(I293,-17,-3)","v":"Aus Top Down Leer"},{"$f":"IF(ISNA(H293),0,1)","v":{"v":0,"d":"0.000"}},{"$f":"INDIRECT(\"'\"&OFFSET(K293,-17,-5)&\"'!E4\")","v":{"v":0,"d":"0.0"}},{"v":0,"d":"0.0"},{"$nulls":3},{"$f":"IF(ISNA($H293),0,zeitausschnitt($G293,$H293,$L293,P$9,P$10))","v":0},{"$f":"IF(ISNA($H293),0,zeitausschnitt($G293,$H293,$L293,Q$9,Q$10))","v":0},0,0,0,0,0,0,0,0,0,0,0,0,0,0,0,0,0,0,0]
[24000,{"$f":"B293","v":24400},{"$f":"C293+1","v":24402},null,"Entwicklung",{"$f":"OFFSET(F294,-18,0)&\" \"&OFFSET(F294,-2,0)&\" \"&INDIRECT(OFFSET(F294,-18,0)&\"!A5\")","v":"Leer Pflege Entwicklung"},{"$f":"G293","v":{"$error":"#N/A"}},{"$f":"H293","v":{"$error":"#N/A"}},{"$f":"\"Aus Top Down \"&OFFSET(I294,-18,-3)","v":"Aus Top Down Leer"},{"$f":"IF(ISNA(H294),0,1)","v":{"v":0,"d":"0.000"}},{"$f":"INDIRECT(\"'\"&OFFSET(K294,-18,-5)&\"'!E5\")","v":{"v":0,"d":"0.0"}},{"v":0,"d":"0.0"},{"$nulls":3},{"$f":"IF(ISNA($H294),0,zeitausschnitt($G294,$H294,$L294,P$9,P$10))","v":0},0,0,0,0,0,0,0,0,0,0,0,0,0,0,0,0,0,0,0,0]
[24000,{"$f":"B294","v":24400},{"$f":"C294+1","v":24403},null,"Test",{"$f":"OFFSET(F295,-19,0)&\" \"&OFFSET(F295,-3,0)&\" \"&INDIRECT(OFFSET(F295,-19,0)&\"!A6\")","v":"Leer Pflege Test"},{"$f":"G294","v":{"$error":"#N/A"}},{"$f":"H294","v":{"$error":"#N/A"}},{"$f":"\"Aus Top Down \"&OFFSET(I295,-19,-3)","v":"Aus Top Down Leer"},{"$f":"IF(ISNA(H295),0,1)","v":{"v":0,"d":"0.000"}},{"$f":"INDIRECT(\"'\"&OFFSET(K295,-19,-5)&\"'!E6\")","v":{"v":0,"d":"0.0"}},{"v":0,"d":"0.0"},{"$nulls":3},0,0,0,0,0,0,0,0,0,0,0,0,0,0,0,0,0,0,0,0,0]
[24000,{"$nulls":10},""]
[{"$nulls":11},{"$f":"IF(AND(J297<>\"\",K297<>\"\"),J297*K297,\"\")","v":""}]
[{"$f":"A277+1000","v":25000},{"$nulls":4},{"$f":"INDIRECT(CONCATENATE(\"Übersicht!C\",TEXT((A298-10000)/1000,0)))","v":"Leer"},{"$f":"MIN(G299:G313)","v":{"$error":"#N/A"}},{"$f":"MAX(H299:H313)","v":{"$error":"#N/A"}},{"$nulls":3},"",{"$f":"SUMIF(A$12:A$519,A298,L$12:L$519)","v":{"v":0,"d":"0.0"}},null,{"$f":"F298","v":"Leer"},{"$f":"SUM(P300:P317)","v":0},{"$f":"SUM(Q300:Q317)","v":0},0,0,0,0,0,0,0,0,0,0,0,0,0,0,0,0,0,0,0]
[{"$f":"A298","v":25000},{"$f":"A298+100","v":25100},{"$nulls":3},{"$f":"INDIRECT(OFFSET(F299,-1,0)&\"!B1\")","v":"Studie"},{"$f":"MIN(G300:G302)","v":"00:00:00"},{"$f":"MAX(H300:H302)","v":{"$error":"#N/A"}},{"$nulls":3},"",{"$f":"SUMIF(B$12:B$519,B299,L$12:L$519)","v":{"v":0,"d":"0.0"}}]
[{"$f":"A299","v":25000},{"$f":"B299","v":25100},{"$f":"B299+1","v":25101},null,"PL",{"$f":"OFFSET(F300,-2,0)&\" \"&OFFSET(F300,-1,0)&\" \"&INDIRECT(OFFSET(F300,-2,0)&\"!A4\")","v":"Leer Studie Projektleitung"},{"$f":"VLOOKUP(OFFSET(G300,-2,-1),Projektübersicht,3,0)","v":"00:00:00"},{"$f":"VLOOKUP(OFFSET(H300,-2,-2),Projektübersicht,4,0)","v":{"$error":"#N/A"}},{"$f":"\"Aus Top Down \"&OFFSET(I300,-2,-3)","v":"Aus Top Down Leer"},{"$f":"IF(ISNA(H300),0,1)","v":{"v":0,"d":"0.000"}},{"$f":"INDIRECT(\"'\"&OFFSET(K300,-2,-5)&\"'!B4\")","v":{"v":0,"d":"0.0"}},{"v":0,"d":"0.0"},{"$nulls":3},{"$f":"IF(ISNA($H300),0,zeitausschnitt($G300,$H300,$L300,P$9,P$10))","v":0},{"$f":"IF(ISNA($H300),0,zeitausschnitt($G300,$H300,$L300,Q$9,Q$10))","v":0},0,0,0,0,0,0,0,0,0,0,0,0,0,0,0,0,0,0,0]
[{"$f":"A300","v":25000},{"$f":"B300","v":25100},{"$f":"C300+1","v":25102},null,"Entwicklung",{"$f":"OFFSET(F301,-3,0)&\" \"&OFFSET(F301,-2,0)&\" \"&INDIRECT(OFFSET(F301,-3,0)&\"!A5\")","v":"Leer Studie Entwicklung"},{"$f":"G300","v":"00:00:00"},{"$f":"H300","v":{"$error":"#N/A"}},{"$f":"\"Aus Top Down \"&OFFSET(I301,-3,-3)","v":"Aus Top Down Leer"},{"$f":"IF(ISNA(H301),0,1)","v":{"v":0,"d":"0.000"}},{"$f":"INDIRECT(\"'\"&OFFSET(K301,-3,-5)&\"'!B5\")","v":{"v":0,"d":"0.0"}},{"v":0,"d":"0.0"},{"$nulls":3},{"$f":"IF(ISNA($H301),0,zeitausschnitt($G301,$H301,$L301,P$9,P$10))","v":0},0,0,0,0,0,0,0,0,0,0,0,0,0,0,0,0,0,0,0,0]
[25000,{"$f":"B301","v":25100},{"$f":"C301+1","v":25103},null,"Test",{"$f":"OFFSET(F302,-4,0)&\" \"&OFFSET(F302,-3,0)&\" \"&INDIRECT(OFFSET(F302,-4,0)&\"!A6\")","v":"Leer Studie Test"},{"$f":"G301","v":"00:00:00"},{"$f":"H301","v":{"$error":"#N/A"}},{"$f":"\"Aus Top Down \"&OFFSET(I302,-4,-3)","v":"Aus Top Down Leer"},{"$f":"IF(ISNA(H302),0,1)","v":{"v":0,"d":"0.000"}},{"$f":"INDIRECT(\"'\"&OFFSET(K302,-4,-5)&\"'!B6\")","v":{"v":0,"d":"0.0"}},{"v":0,"d":"0.0"},{"$nulls":3},0,0,0,0,0,0,0,0,0,0,0,0,0,0,0,0,0,0,0,0,0]
[25000,{"$nulls":10},""]
[25000,{"$f":"B299+100","v":25200},{"$nulls":3},{"$f":"INDIRECT(OFFSET(F304,-6,0)&\"!C1\")","v":"Konzept "},{"$f":"MIN(G305:G307)","v":{"$error":"#N/A"}},{"$f":"MAX(H305:H307)","v":{"$error":"#N/A"}},{"$nulls":3},"",{"$f":"SUMIF(B$12:B$519,B304,L$12:L$519)","v":{"v":0,"d":"0.0"}}]
[25000,{"$f":"B304","v":25200},{"$f":"B304+1","v":25201},null,"PL",{"$f":"OFFSET(F305,-7,0)&\" \"&OFFSET(F305,-1,0)&\" \"&INDIRECT(OFFSET(F305,-7,0)&\"!A4\")","v":"Leer Konzept  Projektleitung"},{"$f":"VLOOKUP(OFFSET(G305,-7,-1),Projektübersicht,4,0)","v":{"$error":"#N/A"}},{"$f":"VLOOKUP(OFFSET(H305,-7,-2),Projektübersicht,5,0)","v":{"$error":"#N/A"}},{"$f":"\"Aus Top Down \"&OFFSET(I305,-7,-3)","v":"Aus Top Down Leer"},{"$f":"IF(ISNA(H305),0,1)","v":{"v":0,"d":"0.000"}},{"$f":"INDIRECT(\"'\"&OFFSET(K305,-7,-5)&\"'!C4\")","v":{"v":0,"d":"0.0"}},{"v":0,"d":"0.0"},{"$nulls":3},{"$f":"IF(ISNA($H305),0,zeitausschnitt($G305,$H305,$L305,P$9,P$10))","v":0},{"$f":"IF(ISNA($H305),0,zeitausschnitt($G305,$H305,$L305,Q$9,Q$10))","v":0},0,0,0,0,0,0,0,0,0,0,0,0,0,0,0,0,0,0,0]
[25000,{"$f":"B305","v":25200},{"$f":"C305+1","v":25202},null,"Entwicklung",{"$f":"OFFSET(F306,-8,0)&\" \"&OFFSET(F306,-2,0)&\" \"&INDIRECT(OFFSET(F306,-8,0)&\"!A5\")","v":"Leer Konzept  Entwicklung"},{"$f":"G305","v":{"$error":"#N/A"}},{"$f":"H305","v":{"$error":"#N/A"}},{"$f":"\"Aus Top Down \"&OFFSET(I306,-8,-3)","v":"Aus Top Down Leer"},{"$f":"IF(ISNA(H306),0,1)","v":{"v":0,"d":"0.000"}},{"$f":"INDIRECT(\"'\"&OFFSET(K306,-8,-5)&\"'!C5\")","v":{"v":0,"d":"0.0"}},{"v":0,"d":"0.0"},{"$nulls":3},{"$f":"IF(ISNA($H306),0,zeitausschnitt($G306,$H306,$L306,P$9,P$10))","v":0},0,0,0,0,0,0,0,0,0,0,0,0,0,0,0,0,0,0,0,0]
[25000,{"$f":"B306","v":25200},{"$f":"C306+1","v":25203},null,"Test",{"$f":"OFFSET(F307,-9,0)&\" \"&OFFSET(F307,-3,0)&\" \"&INDIRECT(OFFSET(F307,-9,0)&\"!A6\")","v":"Leer Konzept  Test"},{"$f":"G306","v":{"$error":"#N/A"}},{"$f":"H306","v":{"$error":"#N/A"}},{"$f":"\"Aus Top Down \"&OFFSET(I307,-9,-3)","v":"Aus Top Down Leer"},{"$f":"IF(ISNA(H307),0,1)","v":{"v":0,"d":"0.000"}},{"$f":"INDIRECT(\"'\"&OFFSET(K307,-9,-5)&\"'!C6\")","v":{"v":0,"d":"0.0"}},{"v":0,"d":"0.0"},{"$nulls":3},0,0,0,0,0,0,0,0,0,0,0,0,0,0,0,0,0,0,0,0,0]
[25000,{"$nulls":10},""]
[25000,{"$f":"B304+100","v":25300},{"$nulls":3},{"$f":"INDIRECT(OFFSET(F309,-11,0)&\"!D1\")","v":"Entwicklung"},{"$f":"MIN(G310:G312)","v":{"$error":"#N/A"}},{"$f":"MAX(H310:H312)","v":{"$error":"#N/A"}},{"$nulls":3},"",{"$f":"SUMIF(B$12:B$519,B309,L$12:L$519)","v":{"v":0,"d":"0.0"}}]
[25000,{"$f":"B309","v":25300},{"$f":"B309+1","v":25301},null,"PL",{"$f":"OFFSET(F310,-12,0)&\" \"&OFFSET(F310,-1,0)&\" \"&INDIRECT(OFFSET(F310,-12,0)&\"!A4\")","v":"Leer Entwicklung Projektleitung"},{"$f":"VLOOKUP(OFFSET(G310,-12,-1),Projektübersicht,5,0)","v":{"$error":"#N/A"}},{"$f":"VLOOKUP(OFFSET(H310,-12,-2),Projektübersicht,6,0)","v":{"$error":"#N/A"}},{"$f":"\"Aus Top Down \"&OFFSET(I310,-12,-3)","v":"Aus Top Down Leer"},{"$f":"IF(ISNA(H310),0,1)","v":{"v":0,"d":"0.000"}},{"$f":"INDIRECT(\"'\"&OFFSET(K310,-12,-5)&\"'!D4\")","v":{"v":0,"d":"0.0"}},{"v":0,"d":"0.0"},{"$nulls":3},{"$f":"IF(ISNA($H310),0,zeitausschnitt($G310,$H310,$L310,P$9,P$10))","v":0},{"$f":"IF(ISNA($H310),0,zeitausschnitt($G310,$H310,$L310,Q$9,Q$10))","v":0},0,0,0,0,0,0,0,0,0,0,0,0,0,0,0,0,0,0,0]
[25000,{"$f":"B310","v":25300},{"$f":"C310+1","v":25302},null,"Entwicklung",{"$f":"OFFSET(F311,-13,0)&\" \"&OFFSET(F311,-2,0)&\" \"&INDIRECT(OFFSET(F311,-13,0)&\"!A5\")","v":"Leer Entwicklung Entwicklung"},{"$f":"G310","v":{"$error":"#N/A"}},{"$f":"H310","v":{"$error":"#N/A"}},{"$f":"\"Aus Top Down \"&OFFSET(I311,-13,-3)","v":"Aus Top Down Leer"},{"$f":"IF(ISNA(H311),0,1)","v":{"v":0,"d":"0.000"}},{"$f":"INDIRECT(\"'\"&OFFSET(K311,-13,-5)&\"'!D5\")","v":{"v":0,"d":"0.0"}},{"v":0,"d":"0.0"},{"$nulls":3},{"$f":"IF(ISNA($H311),0,zeitausschnitt($G311,$H311,$L311,P$9,P$10))","v":0},0,0,0,0,0,0,0,0,0,0,0,0,0,0,0,0,0,0,0,0]
[25000,{"$f":"B311","v":25300},{"$f":"C311+1","v":25303},null,"Test",{"$f":"OFFSET(F312,-14,0)&\" \"&OFFSET(F312,-3,0)&\" \"&INDIRECT(OFFSET(F312,-14,0)&\"!A6\")","v":"Leer Entwicklung Test"},{"$f":"G311","v":{"$error":"#N/A"}},{"$f":"H311","v":{"$error":"#N/A"}},{"$f":"\"Aus Top Down \"&OFFSET(I312,-14,-3)","v":"Aus Top Down Leer"},{"$f":"IF(ISNA(H312),0,1)","v":{"v":0,"d":"0.000"}},{"$f":"INDIRECT(\"'\"&OFFSET(K312,-14,-5)&\"'!D6\")","v":{"v":0,"d":"0.0"}},{"v":0,"d":"0.0"},{"$nulls":3},0,0,0,0,0,0,0,0,0,0,0,0,0,0,0,0,0,0,0,0,0]
[25000,{"$nulls":10},""]
[25000,{"$f":"B309+100","v":25400},{"$nulls":3},{"$f":"INDIRECT(OFFSET(F314,-16,0)&\"!E1\")","v":"Pflege"},{"$f":"MIN(G315:G317)","v":{"$error":"#N/A"}},{"$f":"MAX(H315:H317)","v":{"$error":"#N/A"}},{"$nulls":3},"",{"$f":"SUMIF(B$12:B$519,B314,L$12:L$519)","v":{"v":0,"d":"0.0"}}]
[25000,{"$f":"B314","v":25400},{"$f":"B314+1","v":25401},null,"PL",{"$f":"OFFSET(F315,-17,0)&\" \"&OFFSET(F315,-1,0)&\" \"&INDIRECT(OFFSET(F315,-17,0)&\"!A4\")","v":"Leer Pflege Projektleitung"},{"$f":"VLOOKUP(OFFSET(G315,-17,-1),Projektübersicht,6,0)","v":{"$error":"#N/A"}},{"$f":"VLOOKUP(OFFSET(H315,-17,-2),Projektübersicht,7,0)","v":{"$error":"#N/A"}},{"$f":"\"Aus Top Down \"&OFFSET(I315,-17,-3)","v":"Aus Top Down Leer"},{"$f":"IF(ISNA(H315),0,1)","v":{"v":0,"d":"0.000"}},{"$f":"INDIRECT(\"'\"&OFFSET(K315,-17,-5)&\"'!E4\")","v":{"v":0,"d":"0.0"}},{"v":0,"d":"0.0"},{"$nulls":3},{"$f":"IF(ISNA($H315),0,zeitausschnitt($G315,$H315,$L315,P$9,P$10))","v":0},{"$f":"IF(ISNA($H315),0,zeitausschnitt($G315,$H315,$L315,Q$9,Q$10))","v":0},0,0,0,0,0,0,0,0,0,0,0,0,0,0,0,0,0,0,0]
[25000,{"$f":"B315","v":25400},{"$f":"C315+1","v":25402},null,"Entwicklung",{"$f":"OFFSET(F316,-18,0)&\" \"&OFFSET(F316,-2,0)&\" \"&INDIRECT(OFFSET(F316,-18,0)&\"!A5\")","v":"Leer Pflege Entwicklung"},{"$f":"G315","v":{"$error":"#N/A"}},{"$f":"H315","v":{"$error":"#N/A"}},{"$f":"\"Aus Top Down \"&OFFSET(I316,-18,-3)","v":"Aus Top Down Leer"},{"$f":"IF(ISNA(H316),0,1)","v":{"v":0,"d":"0.000"}},{"$f":"INDIRECT(\"'\"&OFFSET(K316,-18,-5)&\"'!E5\")","v":{"v":0,"d":"0.0"}},{"v":0,"d":"0.0"},{"$nulls":3},{"$f":"IF(ISNA($H316),0,zeitausschnitt($G316,$H316,$L316,P$9,P$10))","v":0},0,0,0,0,0,0,0,0,0,0,0,0,0,0,0,0,0,0,0,0]
[25000,{"$f":"B316","v":25400},{"$f":"C316+1","v":25403},null,"Test",{"$f":"OFFSET(F317,-19,0)&\" \"&OFFSET(F317,-3,0)&\" \"&INDIRECT(OFFSET(F317,-19,0)&\"!A6\")","v":"Leer Pflege Test"},{"$f":"G316","v":{"$error":"#N/A"}},{"$f":"H316","v":{"$error":"#N/A"}},{"$f":"\"Aus Top Down \"&OFFSET(I317,-19,-3)","v":"Aus Top Down Leer"},{"$f":"IF(ISNA(H317),0,1)","v":{"v":0,"d":"0.000"}},{"$f":"INDIRECT(\"'\"&OFFSET(K317,-19,-5)&\"'!E6\")","v":{"v":0,"d":"0.0"}},{"v":0,"d":"0.0"},{"$nulls":3},0,0,0,0,0,0,0,0,0,0,0,0,0,0,0,0,0,0,0,0,0]
[25000,{"$nulls":10},""]
[{"$nulls":11},""]
[{"$f":"A298+1000","v":26000},{"$nulls":4},{"$f":"INDIRECT(CONCATENATE(\"Übersicht!C\",TEXT((A320-10000)/1000,0)))","v":"Leer"},{"$f":"MIN(G321:G335)","v":{"$error":"#N/A"}},{"$f":"MAX(H321:H335)","v":{"$error":"#N/A"}},{"$nulls":3},"",{"$f":"SUMIF(A$12:A$519,A320,L$12:L$519)","v":{"v":0,"d":"0.0"}},null,{"$f":"F320","v":"Leer"},{"$f":"SUM(P322:P339)","v":0},{"$f":"SUM(Q322:Q339)","v":0},0,0,0,0,0,0,0,0,0,0,0,0,0,0,0,0,0,0,0]
[{"$f":"A320","v":26000},{"$f":"A320+100","v":26100},{"$nulls":3},{"$f":"INDIRECT(OFFSET(F321,-1,0)&\"!B1\")","v":"Studie"},{"$f":"MIN(G322:G324)","v":"00:00:00"},{"$f":"MAX(H322:H324)","v":{"$error":"#N/A"}},{"$nulls":3},"",{"$f":"SUMIF(B$12:B$519,B321,L$12:L$519)","v":{"v":0,"d":"0.0"}}]
[{"$f":"A321","v":26000},{"$f":"B321","v":26100},{"$f":"B321+1","v":26101},null,"PL",{"$f":"OFFSET(F322,-2,0)&\" \"&OFFSET(F322,-1,0)&\" \"&INDIRECT(OFFSET(F322,-2,0)&\"!A4\")","v":"Leer Studie Projektleitung"},{"$f":"VLOOKUP(OFFSET(G322,-2,-1),Projektübersicht,3,0)","v":"00:00:00"},{"$f":"VLOOKUP(OFFSET(H322,-2,-2),Projektübersicht,4,0)","v":{"$error":"#N/A"}},{"$f":"\"Aus Top Down \"&OFFSET(I322,-2,-3)","v":"Aus Top Down Leer"},{"$f":"IF(ISNA(H322),0,1)","v":{"v":0,"d":"0.000"}},{"$f":"INDIRECT(\"'\"&OFFSET(K322,-2,-5)&\"'!B4\")","v":{"v":0,"d":"0.0"}},{"v":0,"d":"0.0"},{"$nulls":3},{"$f":"IF(ISNA($H322),0,zeitausschnitt($G322,$H322,$L322,P$9,P$10))","v":0},{"$f":"IF(ISNA($H322),0,zeitausschnitt($G322,$H322,$L322,Q$9,Q$10))","v":0},0,0,0,0,0,0,0,0,0,0,0,0,0,0,0,0,0,0,0]
[{"$f":"A322","v":26000},{"$f":"B322","v":26100},{"$f":"C322+1","v":26102},null,"Entwicklung",{"$f":"OFFSET(F323,-3,0)&\" \"&OFFSET(F323,-2,0)&\" \"&INDIRECT(OFFSET(F323,-3,0)&\"!A5\")","v":"Leer Studie Entwicklung"},{"$f":"G322","v":"00:00:00"},{"$f":"H322","v":{"$error":"#N/A"}},{"$f":"\"Aus Top Down \"&OFFSET(I323,-3,-3)","v":"Aus Top Down Leer"},{"$f":"IF(ISNA(H323),0,1)","v":{"v":0,"d":"0.000"}},{"$f":"INDIRECT(\"'\"&OFFSET(K323,-3,-5)&\"'!B5\")","v":{"v":0,"d":"0.0"}},{"v":0,"d":"0.0"},{"$nulls":3},{"$f":"IF(ISNA($H323),0,zeitausschnitt($G323,$H323,$L323,P$9,P$10))","v":0},0,0,0,0,0,0,0,0,0,0,0,0,0,0,0,0,0,0,0,0]
[26000,{"$f":"B323","v":26100},{"$f":"C323+1","v":26103},null,"Test",{"$f":"OFFSET(F324,-4,0)&\" \"&OFFSET(F324,-3,0)&\" \"&INDIRECT(OFFSET(F324,-4,0)&\"!A6\")","v":"Leer Studie Test"},{"$f":"G323","v":"00:00:00"},{"$f":"H323","v":{"$error":"#N/A"}},{"$f":"\"Aus Top Down \"&OFFSET(I324,-4,-3)","v":"Aus Top Down Leer"},{"$f":"IF(ISNA(H324),0,1)","v":{"v":0,"d":"0.000"}},{"$f":"INDIRECT(\"'\"&OFFSET(K324,-4,-5)&\"'!B6\")","v":{"v":0,"d":"0.0"}},{"v":0,"d":"0.0"},{"$nulls":3},0,0,0,0,0,0,0,0,0,0,0,0,0,0,0,0,0,0,0,0,0]
[26000,{"$nulls":10},""]
[26000,{"$f":"B321+100","v":26200},{"$nulls":3},{"$f":"INDIRECT(OFFSET(F326,-6,0)&\"!C1\")","v":"Konzept "},{"$f":"MIN(G327:G329)","v":{"$error":"#N/A"}},{"$f":"MAX(H327:H329)","v":{"$error":"#N/A"}},{"$nulls":3},"",{"$f":"SUMIF(B$12:B$519,B326,L$12:L$519)","v":{"v":0,"d":"0.0"}}]
[26000,{"$f":"B326","v":26200},{"$f":"B326+1","v":26201},null,"PL",{"$f":"OFFSET(F327,-7,0)&\" \"&OFFSET(F327,-1,0)&\" \"&INDIRECT(OFFSET(F327,-7,0)&\"!A4\")","v":"Leer Konzept  Projektleitung"},{"$f":"VLOOKUP(OFFSET(G327,-7,-1),Projektübersicht,4,0)","v":{"$error":"#N/A"}},{"$f":"VLOOKUP(OFFSET(H327,-7,-2),Projektübersicht,5,0)","v":{"$error":"#N/A"}},{"$f":"\"Aus Top Down \"&OFFSET(I327,-7,-3)","v":"Aus Top Down Leer"},{"$f":"IF(ISNA(H327),0,1)","v":{"v":0,"d":"0.000"}},{"$f":"INDIRECT(\"'\"&OFFSET(K327,-7,-5)&\"'!C4\")","v":{"v":0,"d":"0.0"}},{"v":0,"d":"0.0"},{"$nulls":3},{"$f":"IF(ISNA($H327),0,zeitausschnitt($G327,$H327,$L327,P$9,P$10))","v":0},{"$f":"IF(ISNA($H327),0,zeitausschnitt($G327,$H327,$L327,Q$9,Q$10))","v":0},0,0,0,0,0,0,0,0,0,0,0,0,0,0,0,0,0,0,0]
[26000,{"$f":"B327","v":26200},{"$f":"C327+1","v":26202},null,"Entwicklung",{"$f":"OFFSET(F328,-8,0)&\" \"&OFFSET(F328,-2,0)&\" \"&INDIRECT(OFFSET(F328,-8,0)&\"!A5\")","v":"Leer Konzept  Entwicklung"},{"$f":"G327","v":{"$error":"#N/A"}},{"$f":"H327","v":{"$error":"#N/A"}},{"$f":"\"Aus Top Down \"&OFFSET(I328,-8,-3)","v":"Aus Top Down Leer"},{"$f":"IF(ISNA(H328),0,1)","v":{"v":0,"d":"0.000"}},{"$f":"INDIRECT(\"'\"&OFFSET(K328,-8,-5)&\"'!C5\")","v":{"v":0,"d":"0.0"}},{"v":0,"d":"0.0"},{"$nulls":3},{"$f":"IF(ISNA($H328),0,zeitausschnitt($G328,$H328,$L328,P$9,P$10))","v":0},0,0,0,0,0,0,0,0,0,0,0,0,0,0,0,0,0,0,0,0]
[26000,{"$f":"B328","v":26200},{"$f":"C328+1","v":26203},null,"Test",{"$f":"OFFSET(F329,-9,0)&\" \"&OFFSET(F329,-3,0)&\" \"&INDIRECT(OFFSET(F329,-9,0)&\"!A6\")","v":"Leer Konzept  Test"},{"$f":"G328","v":{"$error":"#N/A"}},{"$f":"H328","v":{"$error":"#N/A"}},{"$f":"\"Aus Top Down \"&OFFSET(I329,-9,-3)","v":"Aus Top Down Leer"},{"$f":"IF(ISNA(H329),0,1)","v":{"v":0,"d":"0.000"}},{"$f":"INDIRECT(\"'\"&OFFSET(K329,-9,-5)&\"'!C6\")","v":{"v":0,"d":"0.0"}},{"v":0,"d":"0.0"},{"$nulls":3},0,0,0,0,0,0,0,0,0,0,0,0,0,0,0,0,0,0,0,0,0]
[26000,{"$nulls":10},""]
[26000,{"$f":"B326+100","v":26300},{"$nulls":3},{"$f":"INDIRECT(OFFSET(F331,-11,0)&\"!D1\")","v":"Entwicklung"},{"$f":"MIN(G332:G334)","v":{"$error":"#N/A"}},{"$f":"MAX(H332:H334)","v":{"$error":"#N/A"}},{"$nulls":3},"",{"$f":"SUMIF(B$12:B$519,B331,L$12:L$519)","v":{"v":0,"d":"0.0"}}]
[26000,{"$f":"B331","v":26300},{"$f":"B331+1","v":26301},null,"PL",{"$f":"OFFSET(F332,-12,0)&\" \"&OFFSET(F332,-1,0)&\" \"&INDIRECT(OFFSET(F332,-12,0)&\"!A4\")","v":"Leer Entwicklung Projektleitung"},{"$f":"VLOOKUP(OFFSET(G332,-12,-1),Projektübersicht,5,0)","v":{"$error":"#N/A"}},{"$f":"VLOOKUP(OFFSET(H332,-12,-2),Projektübersicht,6,0)","v":{"$error":"#N/A"}},{"$f":"\"Aus Top Down \"&OFFSET(I332,-12,-3)","v":"Aus Top Down Leer"},{"$f":"IF(ISNA(H332),0,1)","v":{"v":0,"d":"0.000"}},{"$f":"INDIRECT(\"'\"&OFFSET(K332,-12,-5)&\"'!D4\")","v":{"v":0,"d":"0.0"}},{"v":0,"d":"0.0"},{"$nulls":3},{"$f":"IF(ISNA($H332),0,zeitausschnitt($G332,$H332,$L332,P$9,P$10))","v":0},{"$f":"IF(ISNA($H332),0,zeitausschnitt($G332,$H332,$L332,Q$9,Q$10))","v":0},0,0,0,0,0,0,0,0,0,0,0,0,0,0,0,0,0,0,0]
[26000,{"$f":"B332","v":26300},{"$f":"C332+1","v":26302},null,"Entwicklung",{"$f":"OFFSET(F333,-13,0)&\" \"&OFFSET(F333,-2,0)&\" \"&INDIRECT(OFFSET(F333,-13,0)&\"!A5\")","v":"Leer Entwicklung Entwicklung"},{"$f":"G332","v":{"$error":"#N/A"}},{"$f":"H332","v":{"$error":"#N/A"}},{"$f":"\"Aus Top Down \"&OFFSET(I333,-13,-3)","v":"Aus Top Down Leer"},{"$f":"IF(ISNA(H333),0,1)","v":{"v":0,"d":"0.000"}},{"$f":"INDIRECT(\"'\"&OFFSET(K333,-13,-5)&\"'!D5\")","v":{"v":0,"d":"0.0"}},{"v":0,"d":"0.0"},{"$nulls":3},{"$f":"IF(ISNA($H333),0,zeitausschnitt($G333,$H333,$L333,P$9,P$10))","v":0},0,0,0,0,0,0,0,0,0,0,0,0,0,0,0,0,0,0,0,0]
[26000,{"$f":"B333","v":26300},{"$f":"C333+1","v":26303},null,"Test",{"$f":"OFFSET(F334,-14,0)&\" \"&OFFSET(F334,-3,0)&\" \"&INDIRECT(OFFSET(F334,-14,0)&\"!A6\")","v":"Leer Entwicklung Test"},{"$f":"G333","v":{"$error":"#N/A"}},{"$f":"H333","v":{"$error":"#N/A"}},{"$f":"\"Aus Top Down \"&OFFSET(I334,-14,-3)","v":"Aus Top Down Leer"},{"$f":"IF(ISNA(H334),0,1)","v":{"v":0,"d":"0.000"}},{"$f":"INDIRECT(\"'\"&OFFSET(K334,-14,-5)&\"'!D6\")","v":{"v":0,"d":"0.0"}},{"v":0,"d":"0.0"},{"$nulls":3},0,0,0,0,0,0,0,0,0,0,0,0,0,0,0,0,0,0,0,0,0]
[26000,{"$nulls":10},""]
[26000,{"$f":"B331+100","v":26400},{"$nulls":3},{"$f":"INDIRECT(OFFSET(F336,-16,0)&\"!E1\")","v":"Pflege"},{"$f":"MIN(G337:G339)","v":{"$error":"#N/A"}},{"$f":"MAX(H337:H339)","v":{"$error":"#N/A"}},{"$nulls":3},"",{"$f":"SUMIF(B$12:B$519,B336,L$12:L$519)","v":{"v":0,"d":"0.0"}}]
[26000,{"$f":"B336","v":26400},{"$f":"B336+1","v":26401},null,"PL",{"$f":"OFFSET(F337,-17,0)&\" \"&OFFSET(F337,-1,0)&\" \"&INDIRECT(OFFSET(F337,-17,0)&\"!A4\")","v":"Leer Pflege Projektleitung"},{"$f":"VLOOKUP(OFFSET(G337,-17,-1),Projektübersicht,6,0)","v":{"$error":"#N/A"}},{"$f":"VLOOKUP(OFFSET(H337,-17,-2),Projektübersicht,7,0)","v":{"$error":"#N/A"}},{"$f":"\"Aus Top Down \"&OFFSET(I337,-17,-3)","v":"Aus Top Down Leer"},{"$f":"IF(ISNA(H337),0,1)","v":{"v":0,"d":"0.000"}},{"$f":"INDIRECT(\"'\"&OFFSET(K337,-17,-5)&\"'!E4\")","v":{"v":0,"d":"0.0"}},{"v":0,"d":"0.0"},{"$nulls":3},{"$f":"IF(ISNA($H337),0,zeitausschnitt($G337,$H337,$L337,P$9,P$10))","v":0},{"$f":"IF(ISNA($H337),0,zeitausschnitt($G337,$H337,$L337,Q$9,Q$10))","v":0},0,0,0,0,0,0,0,0,0,0,0,0,0,0,0,0,0,0,0]
[26000,{"$f":"B337","v":26400},{"$f":"C337+1","v":26402},null,"Entwicklung",{"$f":"OFFSET(F338,-18,0)&\" \"&OFFSET(F338,-2,0)&\" \"&INDIRECT(OFFSET(F338,-18,0)&\"!A5\")","v":"Leer Pflege Entwicklung"},{"$f":"G337","v":{"$error":"#N/A"}},{"$f":"H337","v":{"$error":"#N/A"}},{"$f":"\"Aus Top Down \"&OFFSET(I338,-18,-3)","v":"Aus Top Down Leer"},{"$f":"IF(ISNA(H338),0,1)","v":{"v":0,"d":"0.000"}},{"$f":"INDIRECT(\"'\"&OFFSET(K338,-18,-5)&\"'!E5\")","v":{"v":0,"d":"0.0"}},{"v":0,"d":"0.0"},{"$nulls":3},{"$f":"IF(ISNA($H338),0,zeitausschnitt($G338,$H338,$L338,P$9,P$10))","v":0},0,0,0,0,0,0,0,0,0,0,0,0,0,0,0,0,0,0,0,0]
[26000,{"$f":"B338","v":26400},{"$f":"C338+1","v":26403},null,"Test",{"$f":"OFFSET(F339,-19,0)&\" \"&OFFSET(F339,-3,0)&\" \"&INDIRECT(OFFSET(F339,-19,0)&\"!A6\")","v":"Leer Pflege Test"},{"$f":"G338","v":{"$error":"#N/A"}},{"$f":"H338","v":{"$error":"#N/A"}},{"$f":"\"Aus Top Down \"&OFFSET(I339,-19,-3)","v":"Aus Top Down Leer"},{"$f":"IF(ISNA(H339),0,1)","v":{"v":0,"d":"0.000"}},{"$f":"INDIRECT(\"'\"&OFFSET(K339,-19,-5)&\"'!E6\")","v":{"v":0,"d":"0.0"}},{"v":0,"d":"0.0"},{"$nulls":3},0,0,0,0,0,0,0,0,0,0,0,0,0,0,0,0,0,0,0,0,0]
[26000,{"$nulls":10},""]
[{"$nulls":11},{"$f":"IF(AND(J341<>\"\",K341<>\"\"),J341*K341,\"\")","v":""}]
[{"$f":"A321+1000","v":27000},{"$nulls":4},{"$f":"INDIRECT(CONCATENATE(\"Übersicht!C\",TEXT((A342-10000)/1000,0)))","v":"Leer"},{"$f":"MIN(G343:G357)","v":{"$error":"#N/A"}},{"$f":"MAX(H343:H357)","v":{"$error":"#N/A"}},{"$nulls":3},"",{"$f":"SUMIF(A$12:A$519,A342,L$12:L$519)","v":{"v":0,"d":"0.0"}},null,{"$f":"F342","v":"Leer"},{"$f":"SUM(P344:P361)","v":0},{"$f":"SUM(Q344:Q361)","v":0},0,0,0,0,0,0,0,0,0,0,0,0,0,0,0,0,0,0,0]
[{"$f":"A342","v":27000},{"$f":"A342+100","v":27100},{"$nulls":3},{"$f":"INDIRECT(OFFSET(F343,-1,0)&\"!B1\")","v":"Studie"},{"$f":"MIN(G344:G346)","v":"00:00:00"},{"$f":"MAX(H344:H346)","v":{"$error":"#N/A"}},{"$nulls":3},"",{"$f":"SUMIF(B$12:B$519,B343,L$12:L$519)","v":{"v":0,"d":"0.0"}}]
[{"$f":"A343","v":27000},{"$f":"B343","v":27100},{"$f":"B343+1","v":27101},null,"PL",{"$f":"OFFSET(F344,-2,0)&\" \"&OFFSET(F344,-1,0)&\" \"&INDIRECT(OFFSET(F344,-2,0)&\"!A4\")","v":"Leer Studie Projektleitung"},{"$f":"VLOOKUP(OFFSET(G344,-2,-1),Projektübersicht,3,0)","v":"00:00:00"},{"$f":"VLOOKUP(OFFSET(H344,-2,-2),Projektübersicht,4,0)","v":{"$error":"#N/A"}},{"$f":"\"Aus Top Down \"&OFFSET(I344,-2,-3)","v":"Aus Top Down Leer"},{"$f":"IF(ISNA(H344),0,1)","v":{"v":0,"d":"0.000"}},{"$f":"INDIRECT(\"'\"&OFFSET(K344,-2,-5)&\"'!B4\")","v":{"v":0,"d":"0.0"}},{"v":0,"d":"0.0"},{"$nulls":3},{"$f":"IF(ISNA($H344),0,zeitausschnitt($G344,$H344,$L344,P$9,P$10))","v":0},{"$f":"IF(ISNA($H344),0,zeitausschnitt($G344,$H344,$L344,Q$9,Q$10))","v":0},0,0,0,0,0,0,0,0,0,0,0,0,0,0,0,0,0,0,0]
[{"$f":"A344","v":27000},{"$f":"B344","v":27100},{"$f":"C344+1","v":27102},null,"Entwicklung",{"$f":"OFFSET(F345,-3,0)&\" \"&OFFSET(F345,-2,0)&\" \"&INDIRECT(OFFSET(F345,-3,0)&\"!A5\")","v":"Leer Studie Entwicklung"},{"$f":"G344","v":"00:00:00"},{"$f":"H344","v":{"$error":"#N/A"}},{"$f":"\"Aus Top Down \"&OFFSET(I345,-3,-3)","v":"Aus Top Down Leer"},{"$f":"IF(ISNA(H345),0,1)","v":{"v":0,"d":"0.000"}},{"$f":"INDIRECT(\"'\"&OFFSET(K345,-3,-5)&\"'!B5\")","v":{"v":0,"d":"0.0"}},{"v":0,"d":"0.0"},{"$nulls":3},{"$f":"IF(ISNA($H345),0,zeitausschnitt($G345,$H345,$L345,P$9,P$10))","v":0},0,0,0,0,0,0,0,0,0,0,0,0,0,0,0,0,0,0,0,0]
[27000,{"$f":"B345","v":27100},{"$f":"C345+1","v":27103},null,"Test",{"$f":"OFFSET(F346,-4,0)&\" \"&OFFSET(F346,-3,0)&\" \"&INDIRECT(OFFSET(F346,-4,0)&\"!A6\")","v":"Leer Studie Test"},{"$f":"G345","v":"00:00:00"},{"$f":"H345","v":{"$error":"#N/A"}},{"$f":"\"Aus Top Down \"&OFFSET(I346,-4,-3)","v":"Aus Top Down Leer"},{"$f":"IF(ISNA(H346),0,1)","v":{"v":0,"d":"0.000"}},{"$f":"INDIRECT(\"'\"&OFFSET(K346,-4,-5)&\"'!B6\")","v":{"v":0,"d":"0.0"}},{"v":0,"d":"0.0"},{"$nulls":3},0,0,0,0,0,0,0,0,0,0,0,0,0,0,0,0,0,0,0,0,0]
[27000,{"$nulls":10},""]
[27000,{"$f":"B343+100","v":27200},{"$nulls":3},{"$f":"INDIRECT(OFFSET(F348,-6,0)&\"!C1\")","v":"Konzept "},{"$f":"MIN(G349:G351)","v":{"$error":"#N/A"}},{"$f":"MAX(H349:H351)","v":{"$error":"#N/A"}},{"$nulls":3},"",{"$f":"SUMIF(B$12:B$519,B348,L$12:L$519)","v":{"v":0,"d":"0.0"}}]
[27000,{"$f":"B348","v":27200},{"$f":"B348+1","v":27201},null,"PL",{"$f":"OFFSET(F349,-7,0)&\" \"&OFFSET(F349,-1,0)&\" \"&INDIRECT(OFFSET(F349,-7,0)&\"!A4\")","v":"Leer Konzept  Projektleitung"},{"$f":"VLOOKUP(OFFSET(G349,-7,-1),Projektübersicht,4,0)","v":{"$error":"#N/A"}},{"$f":"VLOOKUP(OFFSET(H349,-7,-2),Projektübersicht,5,0)","v":{"$error":"#N/A"}},{"$f":"\"Aus Top Down \"&OFFSET(I349,-7,-3)","v":"Aus Top Down Leer"},{"$f":"IF(ISNA(H349),0,1)","v":{"v":0,"d":"0.000"}},{"$f":"INDIRECT(\"'\"&OFFSET(K349,-7,-5)&\"'!C4\")","v":{"v":0,"d":"0.0"}},{"v":0,"d":"0.0"},{"$nulls":3},{"$f":"IF(ISNA($H349),0,zeitausschnitt($G349,$H349,$L349,P$9,P$10))","v":0},{"$f":"IF(ISNA($H349),0,zeitausschnitt($G349,$H349,$L349,Q$9,Q$10))","v":0},0,0,0,0,0,0,0,0,0,0,0,0,0,0,0,0,0,0,0]
[27000,{"$f":"B349","v":27200},{"$f":"C349+1","v":27202},null,"Entwicklung",{"$f":"OFFSET(F350,-8,0)&\" \"&OFFSET(F350,-2,0)&\" \"&INDIRECT(OFFSET(F350,-8,0)&\"!A5\")","v":"Leer Konzept  Entwicklung"},{"$f":"G349","v":{"$error":"#N/A"}},{"$f":"H349","v":{"$error":"#N/A"}},{"$f":"\"Aus Top Down \"&OFFSET(I350,-8,-3)","v":"Aus Top Down Leer"},{"$f":"IF(ISNA(H350),0,1)","v":{"v":0,"d":"0.000"}},{"$f":"INDIRECT(\"'\"&OFFSET(K350,-8,-5)&\"'!C5\")","v":{"v":0,"d":"0.0"}},{"v":0,"d":"0.0"},{"$nulls":3},{"$f":"IF(ISNA($H350),0,zeitausschnitt($G350,$H350,$L350,P$9,P$10))","v":0},0,0,0,0,0,0,0,0,0,0,0,0,0,0,0,0,0,0,0,0]
[27000,{"$f":"B350","v":27200},{"$f":"C350+1","v":27203},null,"Test",{"$f":"OFFSET(F351,-9,0)&\" \"&OFFSET(F351,-3,0)&\" \"&INDIRECT(OFFSET(F351,-9,0)&\"!A6\")","v":"Leer Konzept  Test"},{"$f":"G350","v":{"$error":"#N/A"}},{"$f":"H350","v":{"$error":"#N/A"}},{"$f":"\"Aus Top Down \"&OFFSET(I351,-9,-3)","v":"Aus Top Down Leer"},{"$f":"IF(ISNA(H351),0,1)","v":{"v":0,"d":"0.000"}},{"$f":"INDIRECT(\"'\"&OFFSET(K351,-9,-5)&\"'!C6\")","v":{"v":0,"d":"0.0"}},{"v":0,"d":"0.0"},{"$nulls":3},0,0,0,0,0,0,0,0,0,0,0,0,0,0,0,0,0,0,0,0,0]
[27000,{"$nulls":10},""]
[27000,{"$f":"B348+100","v":27300},{"$nulls":3},{"$f":"INDIRECT(OFFSET(F353,-11,0)&\"!D1\")","v":"Entwicklung"},{"$f":"MIN(G354:G356)","v":{"$error":"#N/A"}},{"$f":"MAX(H354:H356)","v":{"$error":"#N/A"}},{"$nulls":3},"",{"$f":"SUMIF(B$12:B$519,B353,L$12:L$519)","v":{"v":0,"d":"0.0"}}]
[27000,{"$f":"B353","v":27300},{"$f":"B353+1","v":27301},null,"PL",{"$f":"OFFSET(F354,-12,0)&\" \"&OFFSET(F354,-1,0)&\" \"&INDIRECT(OFFSET(F354,-12,0)&\"!A4\")","v":"Leer Entwicklung Projektleitung"},{"$f":"VLOOKUP(OFFSET(G354,-12,-1),Projektübersicht,5,0)","v":{"$error":"#N/A"}},{"$f":"VLOOKUP(OFFSET(H354,-12,-2),Projektübersicht,6,0)","v":{"$error":"#N/A"}},{"$f":"\"Aus Top Down \"&OFFSET(I354,-12,-3)","v":"Aus Top Down Leer"},{"$f":"IF(ISNA(H354),0,1)","v":{"v":0,"d":"0.000"}},{"$f":"INDIRECT(\"'\"&OFFSET(K354,-12,-5)&\"'!D4\")","v":{"v":0,"d":"0.0"}},{"v":0,"d":"0.0"},{"$nulls":3},{"$f":"IF(ISNA($H354),0,zeitausschnitt($G354,$H354,$L354,P$9,P$10))","v":0},{"$f":"IF(ISNA($H354),0,zeitausschnitt($G354,$H354,$L354,Q$9,Q$10))","v":0},0,0,0,0,0,0,0,0,0,0,0,0,0,0,0,0,0,0,0]
[27000,{"$f":"B354","v":27300},{"$f":"C354+1","v":27302},null,"Entwicklung",{"$f":"OFFSET(F355,-13,0)&\" \"&OFFSET(F355,-2,0)&\" \"&INDIRECT(OFFSET(F355,-13,0)&\"!A5\")","v":"Leer Entwicklung Entwicklung"},{"$f":"G354","v":{"$error":"#N/A"}},{"$f":"H354","v":{"$error":"#N/A"}},{"$f":"\"Aus Top Down \"&OFFSET(I355,-13,-3)","v":"Aus Top Down Leer"},{"$f":"IF(ISNA(H355),0,1)","v":{"v":0,"d":"0.000"}},{"$f":"INDIRECT(\"'\"&OFFSET(K355,-13,-5)&\"'!D5\")","v":{"v":0,"d":"0.0"}},{"v":0,"d":"0.0"},{"$nulls":3},{"$f":"IF(ISNA($H355),0,zeitausschnitt($G355,$H355,$L355,P$9,P$10))","v":0},0,0,0,0,0,0,0,0,0,0,0,0,0,0,0,0,0,0,0,0]
[27000,{"$f":"B355","v":27300},{"$f":"C355+1","v":27303},null,"Test",{"$f":"OFFSET(F356,-14,0)&\" \"&OFFSET(F356,-3,0)&\" \"&INDIRECT(OFFSET(F356,-14,0)&\"!A6\")","v":"Leer Entwicklung Test"},{"$f":"G355","v":{"$error":"#N/A"}},{"$f":"H355","v":{"$error":"#N/A"}},{"$f":"\"Aus Top Down \"&OFFSET(I356,-14,-3)","v":"Aus Top Down Leer"},{"$f":"IF(ISNA(H356),0,1)","v":{"v":0,"d":"0.000"}},{"$f":"INDIRECT(\"'\"&OFFSET(K356,-14,-5)&\"'!D6\")","v":{"v":0,"d":"0.0"}},{"v":0,"d":"0.0"},{"$nulls":3},0,0,0,0,0,0,0,0,0,0,0,0,0,0,0,0,0,0,0,0,0]
[27000,{"$nulls":10},""]
[27000,{"$f":"B353+100","v":27400},{"$nulls":3},{"$f":"INDIRECT(OFFSET(F358,-16,0)&\"!E1\")","v":"Pflege"},{"$f":"MIN(G359:G361)","v":{"$error":"#N/A"}},{"$f":"MAX(H359:H361)","v":{"$error":"#N/A"}},{"$nulls":3},"",{"$f":"SUMIF(B$12:B$519,B358,L$12:L$519)","v":{"v":0,"d":"0.0"}}]
[27000,{"$f":"B358","v":27400},{"$f":"B358+1","v":27401},null,"PL",{"$f":"OFFSET(F359,-17,0)&\" \"&OFFSET(F359,-1,0)&\" \"&INDIRECT(OFFSET(F359,-17,0)&\"!A4\")","v":"Leer Pflege Projektleitung"},{"$f":"VLOOKUP(OFFSET(G359,-17,-1),Projektübersicht,6,0)","v":{"$error":"#N/A"}},{"$f":"VLOOKUP(OFFSET(H359,-17,-2),Projektübersicht,7,0)","v":{"$error":"#N/A"}},{"$f":"\"Aus Top Down \"&OFFSET(I359,-17,-3)","v":"Aus Top Down Leer"},{"$f":"IF(ISNA(H359),0,1)","v":{"v":0,"d":"0.000"}},{"$f":"INDIRECT(\"'\"&OFFSET(K359,-17,-5)&\"'!E4\")","v":{"v":0,"d":"0.0"}},{"v":0,"d":"0.0"},{"$nulls":3},{"$f":"IF(ISNA($H359),0,zeitausschnitt($G359,$H359,$L359,P$9,P$10))","v":0},{"$f":"IF(ISNA($H359),0,zeitausschnitt($G359,$H359,$L359,Q$9,Q$10))","v":0},0,0,0,0,0,0,0,0,0,0,0,0,0,0,0,0,0,0,0]
[27000,{"$f":"B359","v":27400},{"$f":"C359+1","v":27402},null,"Entwicklung",{"$f":"OFFSET(F360,-18,0)&\" \"&OFFSET(F360,-2,0)&\" \"&INDIRECT(OFFSET(F360,-18,0)&\"!A5\")","v":"Leer Pflege Entwicklung"},{"$f":"G359","v":{"$error":"#N/A"}},{"$f":"H359","v":{"$error":"#N/A"}},{"$f":"\"Aus Top Down \"&OFFSET(I360,-18,-3)","v":"Aus Top Down Leer"},{"$f":"IF(ISNA(H360),0,1)","v":{"v":0,"d":"0.000"}},{"$f":"INDIRECT(\"'\"&OFFSET(K360,-18,-5)&\"'!E5\")","v":{"v":0,"d":"0.0"}},{"v":0,"d":"0.0"},{"$nulls":3},{"$f":"IF(ISNA($H360),0,zeitausschnitt($G360,$H360,$L360,P$9,P$10))","v":0},0,0,0,0,0,0,0,0,0,0,0,0,0,0,0,0,0,0,0,0]
[27000,{"$f":"B360","v":27400},{"$f":"C360+1","v":27403},null,"Test",{"$f":"OFFSET(F361,-19,0)&\" \"&OFFSET(F361,-3,0)&\" \"&INDIRECT(OFFSET(F361,-19,0)&\"!A6\")","v":"Leer Pflege Test"},{"$f":"G360","v":{"$error":"#N/A"}},{"$f":"H360","v":{"$error":"#N/A"}},{"$f":"\"Aus Top Down \"&OFFSET(I361,-19,-3)","v":"Aus Top Down Leer"},{"$f":"IF(ISNA(H361),0,1)","v":{"v":0,"d":"0.000"}},{"$f":"INDIRECT(\"'\"&OFFSET(K361,-19,-5)&\"'!E6\")","v":{"v":0,"d":"0.0"}},{"v":0,"d":"0.0"},{"$nulls":3},0,0,0,0,0,0,0,0,0,0,0,0,0,0,0,0,0,0,0,0,0]
[27000,{"$nulls":10},""]
[{"$nulls":11},""]
[{"$f":"A342+1000","v":28000},{"$nulls":4},{"$f":"INDIRECT(CONCATENATE(\"Übersicht!C\",TEXT((A364-10000)/1000,0)))","v":"Leer"},{"$f":"MIN(G365:G379)","v":{"$error":"#N/A"}},{"$f":"MAX(H365:H379)","v":{"$error":"#N/A"}},{"$nulls":3},"",{"$f":"SUMIF(A$12:A$519,A364,L$12:L$519)","v":{"v":0,"d":"0.0"}},null,{"$f":"F364","v":"Leer"},{"$f":"SUM(P366:P383)","v":0},{"$f":"SUM(Q366:Q383)","v":0},0,0,0,0,0,0,0,0,0,0,0,0,0,0,0,0,0,0,0]
[{"$f":"A364","v":28000},{"$f":"A364+100","v":28100},{"$nulls":3},{"$f":"INDIRECT(OFFSET(F365,-1,0)&\"!B1\")","v":"Studie"},{"$f":"MIN(G366:G368)","v":"00:00:00"},{"$f":"MAX(H366:H368)","v":{"$error":"#N/A"}},{"$nulls":3},"",{"$f":"SUMIF(B$12:B$519,B365,L$12:L$519)","v":{"v":0,"d":"0.0"}}]
[{"$f":"A365","v":28000},{"$f":"B365","v":28100},{"$f":"B365+1","v":28101},null,"PL",{"$f":"OFFSET(F366,-2,0)&\" \"&OFFSET(F366,-1,0)&\" \"&INDIRECT(OFFSET(F366,-2,0)&\"!A4\")","v":"Leer Studie Projektleitung"},{"$f":"VLOOKUP(OFFSET(G366,-2,-1),Projektübersicht,3,0)","v":"00:00:00"},{"$f":"VLOOKUP(OFFSET(H366,-2,-2),Projektübersicht,4,0)","v":{"$error":"#N/A"}},{"$f":"\"Aus Top Down \"&OFFSET(I366,-2,-3)","v":"Aus Top Down Leer"},{"$f":"IF(ISNA(H366),0,1)","v":{"v":0,"d":"0.000"}},{"$f":"INDIRECT(\"'\"&OFFSET(K366,-2,-5)&\"'!B4\")","v":{"v":0,"d":"0.0"}},{"v":0,"d":"0.0"},{"$nulls":3},{"$f":"IF(ISNA($H366),0,zeitausschnitt($G366,$H366,$L366,P$9,P$10))","v":0},{"$f":"IF(ISNA($H366),0,zeitausschnitt($G366,$H366,$L366,Q$9,Q$10))","v":0},0,0,0,0,0,0,0,0,0,0,0,0,0,0,0,0,0,0,0]
[{"$f":"A366","v":28000},{"$f":"B366","v":28100},{"$f":"C366+1","v":28102},null,"Entwicklung",{"$f":"OFFSET(F367,-3,0)&\" \"&OFFSET(F367,-2,0)&\" \"&INDIRECT(OFFSET(F367,-3,0)&\"!A5\")","v":"Leer Studie Entwicklung"},{"$f":"G366","v":"00:00:00"},{"$f":"H366","v":{"$error":"#N/A"}},{"$f":"\"Aus Top Down \"&OFFSET(I367,-3,-3)","v":"Aus Top Down Leer"},{"$f":"IF(ISNA(H367),0,1)","v":{"v":0,"d":"0.000"}},{"$f":"INDIRECT(\"'\"&OFFSET(K367,-3,-5)&\"'!B5\")","v":{"v":0,"d":"0.0"}},{"v":0,"d":"0.0"},{"$nulls":3},{"$f":"IF(ISNA($H367),0,zeitausschnitt($G367,$H367,$L367,P$9,P$10))","v":0},0,0,0,0,0,0,0,0,0,0,0,0,0,0,0,0,0,0,0,0]
[28000,{"$f":"B367","v":28100},{"$f":"C367+1","v":28103},null,"Test",{"$f":"OFFSET(F368,-4,0)&\" \"&OFFSET(F368,-3,0)&\" \"&INDIRECT(OFFSET(F368,-4,0)&\"!A6\")","v":"Leer Studie Test"},{"$f":"G367","v":"00:00:00"},{"$f":"H367","v":{"$error":"#N/A"}},{"$f":"\"Aus Top Down \"&OFFSET(I368,-4,-3)","v":"Aus Top Down Leer"},{"$f":"IF(ISNA(H368),0,1)","v":{"v":0,"d":"0.000"}},{"$f":"INDIRECT(\"'\"&OFFSET(K368,-4,-5)&\"'!B6\")","v":{"v":0,"d":"0.0"}},{"v":0,"d":"0.0"},{"$nulls":3},0,0,0,0,0,0,0,0,0,0,0,0,0,0,0,0,0,0,0,0,0]
[28000,{"$nulls":10},""]
[28000,{"$f":"B365+100","v":28200},{"$nulls":3},{"$f":"INDIRECT(OFFSET(F370,-6,0)&\"!C1\")","v":"Konzept "},{"$f":"MIN(G371:G373)","v":{"$error":"#N/A"}},{"$f":"MAX(H371:H373)","v":{"$error":"#N/A"}},{"$nulls":3},"",{"$f":"SUMIF(B$12:B$519,B370,L$12:L$519)","v":{"v":0,"d":"0.0"}}]
[28000,{"$f":"B370","v":28200},{"$f":"B370+1","v":28201},null,"PL",{"$f":"OFFSET(F371,-7,0)&\" \"&OFFSET(F371,-1,0)&\" \"&INDIRECT(OFFSET(F371,-7,0)&\"!A4\")","v":"Leer Konzept  Projektleitung"},{"$f":"VLOOKUP(OFFSET(G371,-7,-1),Projektübersicht,4,0)","v":{"$error":"#N/A"}},{"$f":"VLOOKUP(OFFSET(H371,-7,-2),Projektübersicht,5,0)","v":{"$error":"#N/A"}},{"$f":"\"Aus Top Down \"&OFFSET(I371,-7,-3)","v":"Aus Top Down Leer"},{"$f":"IF(ISNA(H371),0,1)","v":{"v":0,"d":"0.000"}},{"$f":"INDIRECT(\"'\"&OFFSET(K371,-7,-5)&\"'!C4\")","v":{"v":0,"d":"0.0"}},{"v":0,"d":"0.0"},{"$nulls":3},{"$f":"IF(ISNA($H371),0,zeitausschnitt($G371,$H371,$L371,P$9,P$10))","v":0},{"$f":"IF(ISNA($H371),0,zeitausschnitt($G371,$H371,$L371,Q$9,Q$10))","v":0},0,0,0,0,0,0,0,0,0,0,0,0,0,0,0,0,0,0,0]
[28000,{"$f":"B371","v":28200},{"$f":"C371+1","v":28202},null,"Entwicklung",{"$f":"OFFSET(F372,-8,0)&\" \"&OFFSET(F372,-2,0)&\" \"&INDIRECT(OFFSET(F372,-8,0)&\"!A5\")","v":"Leer Konzept  Entwicklung"},{"$f":"G371","v":{"$error":"#N/A"}},{"$f":"H371","v":{"$error":"#N/A"}},{"$f":"\"Aus Top Down \"&OFFSET(I372,-8,-3)","v":"Aus Top Down Leer"},{"$f":"IF(ISNA(H372),0,1)","v":{"v":0,"d":"0.000"}},{"$f":"INDIRECT(\"'\"&OFFSET(K372,-8,-5)&\"'!C5\")","v":{"v":0,"d":"0.0"}},{"v":0,"d":"0.0"},{"$nulls":3},{"$f":"IF(ISNA($H372),0,zeitausschnitt($G372,$H372,$L372,P$9,P$10))","v":0},0,0,0,0,0,0,0,0,0,0,0,0,0,0,0,0,0,0,0,0]
[28000,{"$f":"B372","v":28200},{"$f":"C372+1","v":28203},null,"Test",{"$f":"OFFSET(F373,-9,0)&\" \"&OFFSET(F373,-3,0)&\" \"&INDIRECT(OFFSET(F373,-9,0)&\"!A6\")","v":"Leer Konzept  Test"},{"$f":"G372","v":{"$error":"#N/A"}},{"$f":"H372","v":{"$error":"#N/A"}},{"$f":"\"Aus Top Down \"&OFFSET(I373,-9,-3)","v":"Aus Top Down Leer"},{"$f":"IF(ISNA(H373),0,1)","v":{"v":0,"d":"0.000"}},{"$f":"INDIRECT(\"'\"&OFFSET(K373,-9,-5)&\"'!C6\")","v":{"v":0,"d":"0.0"}},{"v":0,"d":"0.0"},{"$nulls":3},0,0,0,0,0,0,0,0,0,0,0,0,0,0,0,0,0,0,0,0,0]
[28000,{"$nulls":10},""]
[28000,{"$f":"B370+100","v":28300},{"$nulls":3},{"$f":"INDIRECT(OFFSET(F375,-11,0)&\"!D1\")","v":"Entwicklung"},{"$f":"MIN(G376:G378)","v":{"$error":"#N/A"}},{"$f":"MAX(H376:H378)","v":{"$error":"#N/A"}},{"$nulls":3},"",{"$f":"SUMIF(B$12:B$519,B375,L$12:L$519)","v":{"v":0,"d":"0.0"}}]
[28000,{"$f":"B375","v":28300},{"$f":"B375+1","v":28301},null,"PL",{"$f":"OFFSET(F376,-12,0)&\" \"&OFFSET(F376,-1,0)&\" \"&INDIRECT(OFFSET(F376,-12,0)&\"!A4\")","v":"Leer Entwicklung Projektleitung"},{"$f":"VLOOKUP(OFFSET(G376,-12,-1),Projektübersicht,5,0)","v":{"$error":"#N/A"}},{"$f":"VLOOKUP(OFFSET(H376,-12,-2),Projektübersicht,6,0)","v":{"$error":"#N/A"}},{"$f":"\"Aus Top Down \"&OFFSET(I376,-12,-3)","v":"Aus Top Down Leer"},{"$f":"IF(ISNA(H376),0,1)","v":{"v":0,"d":"0.000"}},{"$f":"INDIRECT(\"'\"&OFFSET(K376,-12,-5)&\"'!D4\")","v":{"v":0,"d":"0.0"}},{"v":0,"d":"0.0"},{"$nulls":3},{"$f":"IF(ISNA($H376),0,zeitausschnitt($G376,$H376,$L376,P$9,P$10))","v":0},{"$f":"IF(ISNA($H376),0,zeitausschnitt($G376,$H376,$L376,Q$9,Q$10))","v":0},0,0,0,0,0,0,0,0,0,0,0,0,0,0,0,0,0,0,0]
[28000,{"$f":"B376","v":28300},{"$f":"C376+1","v":28302},null,"Entwicklung",{"$f":"OFFSET(F377,-13,0)&\" \"&OFFSET(F377,-2,0)&\" \"&INDIRECT(OFFSET(F377,-13,0)&\"!A5\")","v":"Leer Entwicklung Entwicklung"},{"$f":"G376","v":{"$error":"#N/A"}},{"$f":"H376","v":{"$error":"#N/A"}},{"$f":"\"Aus Top Down \"&OFFSET(I377,-13,-3)","v":"Aus Top Down Leer"},{"$f":"IF(ISNA(H377),0,1)","v":{"v":0,"d":"0.000"}},{"$f":"INDIRECT(\"'\"&OFFSET(K377,-13,-5)&\"'!D5\")","v":{"v":0,"d":"0.0"}},{"v":0,"d":"0.0"},{"$nulls":3},{"$f":"IF(ISNA($H377),0,zeitausschnitt($G377,$H377,$L377,P$9,P$10))","v":0},0,0,0,0,0,0,0,0,0,0,0,0,0,0,0,0,0,0,0,0]
[28000,{"$f":"B377","v":28300},{"$f":"C377+1","v":28303},null,"Test",{"$f":"OFFSET(F378,-14,0)&\" \"&OFFSET(F378,-3,0)&\" \"&INDIRECT(OFFSET(F378,-14,0)&\"!A6\")","v":"Leer Entwicklung Test"},{"$f":"G377","v":{"$error":"#N/A"}},{"$f":"H377","v":{"$error":"#N/A"}},{"$f":"\"Aus Top Down \"&OFFSET(I378,-14,-3)","v":"Aus Top Down Leer"},{"$f":"IF(ISNA(H378),0,1)","v":{"v":0,"d":"0.000"}},{"$f":"INDIRECT(\"'\"&OFFSET(K378,-14,-5)&\"'!D6\")","v":{"v":0,"d":"0.0"}},{"v":0,"d":"0.0"},{"$nulls":3},0,0,0,0,0,0,0,0,0,0,0,0,0,0,0,0,0,0,0,0,0]
[28000,{"$nulls":10},""]
[28000,{"$f":"B375+100","v":28400},{"$nulls":3},{"$f":"INDIRECT(OFFSET(F380,-16,0)&\"!E1\")","v":"Pflege"},{"$f":"MIN(G381:G383)","v":{"$error":"#N/A"}},{"$f":"MAX(H381:H383)","v":{"$error":"#N/A"}},{"$nulls":3},"",{"$f":"SUMIF(B$12:B$519,B380,L$12:L$519)","v":{"v":0,"d":"0.0"}}]
[28000,{"$f":"B380","v":28400},{"$f":"B380+1","v":28401},null,"PL",{"$f":"OFFSET(F381,-17,0)&\" \"&OFFSET(F381,-1,0)&\" \"&INDIRECT(OFFSET(F381,-17,0)&\"!A4\")","v":"Leer Pflege Projektleitung"},{"$f":"VLOOKUP(OFFSET(G381,-17,-1),Projektübersicht,6,0)","v":{"$error":"#N/A"}},{"$f":"VLOOKUP(OFFSET(H381,-17,-2),Projektübersicht,7,0)","v":{"$error":"#N/A"}},{"$f":"\"Aus Top Down \"&OFFSET(I381,-17,-3)","v":"Aus Top Down Leer"},{"$f":"IF(ISNA(H381),0,1)","v":{"v":0,"d":"0.000"}},{"$f":"INDIRECT(\"'\"&OFFSET(K381,-17,-5)&\"'!E4\")","v":{"v":0,"d":"0.0"}},{"v":0,"d":"0.0"},{"$nulls":3},{"$f":"IF(ISNA($H381),0,zeitausschnitt($G381,$H381,$L381,P$9,P$10))","v":0},{"$f":"IF(ISNA($H381),0,zeitausschnitt($G381,$H381,$L381,Q$9,Q$10))","v":0},0,0,0,0,0,0,0,0,0,0,0,0,0,0,0,0,0,0,0]
[28000,{"$f":"B381","v":28400},{"$f":"C381+1","v":28402},null,"Entwicklung",{"$f":"OFFSET(F382,-18,0)&\" \"&OFFSET(F382,-2,0)&\" \"&INDIRECT(OFFSET(F382,-18,0)&\"!A5\")","v":"Leer Pflege Entwicklung"},{"$f":"G381","v":{"$error":"#N/A"}},{"$f":"H381","v":{"$error":"#N/A"}},{"$f":"\"Aus Top Down \"&OFFSET(I382,-18,-3)","v":"Aus Top Down Leer"},{"$f":"IF(ISNA(H382),0,1)","v":{"v":0,"d":"0.000"}},{"$f":"INDIRECT(\"'\"&OFFSET(K382,-18,-5)&\"'!E5\")","v":{"v":0,"d":"0.0"}},{"v":0,"d":"0.0"},{"$nulls":3},{"$f":"IF(ISNA($H382),0,zeitausschnitt($G382,$H382,$L382,P$9,P$10))","v":0},0,0,0,0,0,0,0,0,0,0,0,0,0,0,0,0,0,0,0,0]
[28000,{"$f":"B382","v":28400},{"$f":"C382+1","v":28403},null,"Test",{"$f":"OFFSET(F383,-19,0)&\" \"&OFFSET(F383,-3,0)&\" \"&INDIRECT(OFFSET(F383,-19,0)&\"!A6\")","v":"Leer Pflege Test"},{"$f":"G382","v":{"$error":"#N/A"}},{"$f":"H382","v":{"$error":"#N/A"}},{"$f":"\"Aus Top Down \"&OFFSET(I383,-19,-3)","v":"Aus Top Down Leer"},{"$f":"IF(ISNA(H383),0,1)","v":{"v":0,"d":"0.000"}},{"$f":"INDIRECT(\"'\"&OFFSET(K383,-19,-5)&\"'!E6\")","v":{"v":0,"d":"0.0"}},{"v":0,"d":"0.0"},{"$nulls":3},0,0,0,0,0,0,0,0,0,0,0,0,0,0,0,0,0,0,0,0,0]
[28000,{"$nulls":10},""]
[{"$nulls":11},{"$f":"IF(AND(J385<>\"\",K385<>\"\"),J385*K385,\"\")","v":""}]
[{"$f":"A365+1000","v":29000},{"$nulls":4},{"$f":"INDIRECT(CONCATENATE(\"Übersicht!C\",TEXT((A386-10000)/1000,0)))","v":"Leer"},{"$f":"MIN(G387:G401)","v":{"$error":"#N/A"}},{"$f":"MAX(H387:H401)","v":{"$error":"#N/A"}},{"$nulls":3},"",{"$f":"SUMIF(A$12:A$519,A386,L$12:L$519)","v":{"v":0,"d":"0.0"}},null,{"$f":"F386","v":"Leer"},{"$f":"SUM(P388:P405)","v":0},{"$f":"SUM(Q388:Q405)","v":0},0,0,0,0,0,0,0,0,0,0,0,0,0,0,0,0,0,0,0]
[{"$f":"A386","v":29000},{"$f":"A386+100","v":29100},{"$nulls":3},{"$f":"INDIRECT(OFFSET(F387,-1,0)&\"!B1\")","v":"Studie"},{"$f":"MIN(G388:G390)","v":"00:00:00"},{"$f":"MAX(H388:H390)","v":{"$error":"#N/A"}},{"$nulls":3},"",{"$f":"SUMIF(B$12:B$519,B387,L$12:L$519)","v":{"v":0,"d":"0.0"}}]
[{"$f":"A387","v":29000},{"$f":"B387","v":29100},{"$f":"B387+1","v":29101},null,"PL",{"$f":"OFFSET(F388,-2,0)&\" \"&OFFSET(F388,-1,0)&\" \"&INDIRECT(OFFSET(F388,-2,0)&\"!A4\")","v":"Leer Studie Projektleitung"},{"$f":"VLOOKUP(OFFSET(G388,-2,-1),Projektübersicht,3,0)","v":"00:00:00"},{"$f":"VLOOKUP(OFFSET(H388,-2,-2),Projektübersicht,4,0)","v":{"$error":"#N/A"}},{"$f":"\"Aus Top Down \"&OFFSET(I388,-2,-3)","v":"Aus Top Down Leer"},{"$f":"IF(ISNA(H388),0,1)","v":{"v":0,"d":"0.000"}},{"$f":"INDIRECT(\"'\"&OFFSET(K388,-2,-5)&\"'!B4\")","v":{"v":0,"d":"0.0"}},{"v":0,"d":"0.0"},{"$nulls":3},{"$f":"IF(ISNA($H388),0,zeitausschnitt($G388,$H388,$L388,P$9,P$10))","v":0},{"$f":"IF(ISNA($H388),0,zeitausschnitt($G388,$H388,$L388,Q$9,Q$10))","v":0},0,0,0,0,0,0,0,0,0,0,0,0,0,0,0,0,0,0,0]
[{"$f":"A388","v":29000},{"$f":"B388","v":29100},{"$f":"C388+1","v":29102},null,"Entwicklung",{"$f":"OFFSET(F389,-3,0)&\" \"&OFFSET(F389,-2,0)&\" \"&INDIRECT(OFFSET(F389,-3,0)&\"!A5\")","v":"Leer Studie Entwicklung"},{"$f":"G388","v":"00:00:00"},{"$f":"H388","v":{"$error":"#N/A"}},{"$f":"\"Aus Top Down \"&OFFSET(I389,-3,-3)","v":"Aus Top Down Leer"},{"$f":"IF(ISNA(H389),0,1)","v":{"v":0,"d":"0.000"}},{"$f":"INDIRECT(\"'\"&OFFSET(K389,-3,-5)&\"'!B5\")","v":{"v":0,"d":"0.0"}},{"v":0,"d":"0.0"},{"$nulls":3},{"$f":"IF(ISNA($H389),0,zeitausschnitt($G389,$H389,$L389,P$9,P$10))","v":0},0,0,0,0,0,0,0,0,0,0,0,0,0,0,0,0,0,0,0,0]
[29000,{"$f":"B389","v":29100},{"$f":"C389+1","v":29103},null,"Test",{"$f":"OFFSET(F390,-4,0)&\" \"&OFFSET(F390,-3,0)&\" \"&INDIRECT(OFFSET(F390,-4,0)&\"!A6\")","v":"Leer Studie Test"},{"$f":"G389","v":"00:00:00"},{"$f":"H389","v":{"$error":"#N/A"}},{"$f":"\"Aus Top Down \"&OFFSET(I390,-4,-3)","v":"Aus Top Down Leer"},{"$f":"IF(ISNA(H390),0,1)","v":{"v":0,"d":"0.000"}},{"$f":"INDIRECT(\"'\"&OFFSET(K390,-4,-5)&\"'!B6\")","v":{"v":0,"d":"0.0"}},{"v":0,"d":"0.0"},{"$nulls":3},0,0,0,0,0,0,0,0,0,0,0,0,0,0,0,0,0,0,0,0,0]
[29000,{"$nulls":10},""]
[29000,{"$f":"B387+100","v":29200},{"$nulls":3},{"$f":"INDIRECT(OFFSET(F392,-6,0)&\"!C1\")","v":"Konzept "},{"$f":"MIN(G393:G395)","v":{"$error":"#N/A"}},{"$f":"MAX(H393:H395)","v":{"$error":"#N/A"}},{"$nulls":3},"",{"$f":"SUMIF(B$12:B$519,B392,L$12:L$519)","v":{"v":0,"d":"0.0"}}]
[29000,{"$f":"B392","v":29200},{"$f":"B392+1","v":29201},null,"PL",{"$f":"OFFSET(F393,-7,0)&\" \"&OFFSET(F393,-1,0)&\" \"&INDIRECT(OFFSET(F393,-7,0)&\"!A4\")","v":"Leer Konzept  Projektleitung"},{"$f":"VLOOKUP(OFFSET(G393,-7,-1),Projektübersicht,4,0)","v":{"$error":"#N/A"}},{"$f":"VLOOKUP(OFFSET(H393,-7,-2),Projektübersicht,5,0)","v":{"$error":"#N/A"}},{"$f":"\"Aus Top Down \"&OFFSET(I393,-7,-3)","v":"Aus Top Down Leer"},{"$f":"IF(ISNA(H393),0,1)","v":{"v":0,"d":"0.000"}},{"$f":"INDIRECT(\"'\"&OFFSET(K393,-7,-5)&\"'!C4\")","v":{"v":0,"d":"0.0"}},{"v":0,"d":"0.0"},{"$nulls":3},{"$f":"IF(ISNA($H393),0,zeitausschnitt($G393,$H393,$L393,P$9,P$10))","v":0},{"$f":"IF(ISNA($H393),0,zeitausschnitt($G393,$H393,$L393,Q$9,Q$10))","v":0},0,0,0,0,0,0,0,0,0,0,0,0,0,0,0,0,0,0,0]
[29000,{"$f":"B393","v":29200},{"$f":"C393+1","v":29202},null,"Entwicklung",{"$f":"OFFSET(F394,-8,0)&\" \"&OFFSET(F394,-2,0)&\" \"&INDIRECT(OFFSET(F394,-8,0)&\"!A5\")","v":"Leer Konzept  Entwicklung"},{"$f":"G393","v":{"$error":"#N/A"}},{"$f":"H393","v":{"$error":"#N/A"}},{"$f":"\"Aus Top Down \"&OFFSET(I394,-8,-3)","v":"Aus Top Down Leer"},{"$f":"IF(ISNA(H394),0,1)","v":{"v":0,"d":"0.000"}},{"$f":"INDIRECT(\"'\"&OFFSET(K394,-8,-5)&\"'!C5\")","v":{"v":0,"d":"0.0"}},{"v":0,"d":"0.0"},{"$nulls":3},{"$f":"IF(ISNA($H394),0,zeitausschnitt($G394,$H394,$L394,P$9,P$10))","v":0},0,0,0,0,0,0,0,0,0,0,0,0,0,0,0,0,0,0,0,0]
[29000,{"$f":"B394","v":29200},{"$f":"C394+1","v":29203},null,"Test",{"$f":"OFFSET(F395,-9,0)&\" \"&OFFSET(F395,-3,0)&\" \"&INDIRECT(OFFSET(F395,-9,0)&\"!A6\")","v":"Leer Konzept  Test"},{"$f":"G394","v":{"$error":"#N/A"}},{"$f":"H394","v":{"$error":"#N/A"}},{"$f":"\"Aus Top Down \"&OFFSET(I395,-9,-3)","v":"Aus Top Down Leer"},{"$f":"IF(ISNA(H395),0,1)","v":{"v":0,"d":"0.000"}},{"$f":"INDIRECT(\"'\"&OFFSET(K395,-9,-5)&\"'!C6\")","v":{"v":0,"d":"0.0"}},{"v":0,"d":"0.0"},{"$nulls":3},0,0,0,0,0,0,0,0,0,0,0,0,0,0,0,0,0,0,0,0,0]
[29000,{"$nulls":10},""]
[29000,{"$f":"B392+100","v":29300},{"$nulls":3},{"$f":"INDIRECT(OFFSET(F397,-11,0)&\"!D1\")","v":"Entwicklung"},{"$f":"MIN(G398:G400)","v":{"$error":"#N/A"}},{"$f":"MAX(H398:H400)","v":{"$error":"#N/A"}},{"$nulls":3},"",{"$f":"SUMIF(B$12:B$519,B397,L$12:L$519)","v":{"v":0,"d":"0.0"}}]
[29000,{"$f":"B397","v":29300},{"$f":"B397+1","v":29301},null,"PL",{"$f":"OFFSET(F398,-12,0)&\" \"&OFFSET(F398,-1,0)&\" \"&INDIRECT(OFFSET(F398,-12,0)&\"!A4\")","v":"Leer Entwicklung Projektleitung"},{"$f":"VLOOKUP(OFFSET(G398,-12,-1),Projektübersicht,5,0)","v":{"$error":"#N/A"}},{"$f":"VLOOKUP(OFFSET(H398,-12,-2),Projektübersicht,6,0)","v":{"$error":"#N/A"}},{"$f":"\"Aus Top Down \"&OFFSET(I398,-12,-3)","v":"Aus Top Down Leer"},{"$f":"IF(ISNA(H398),0,1)","v":{"v":0,"d":"0.000"}},{"$f":"INDIRECT(\"'\"&OFFSET(K398,-12,-5)&\"'!D4\")","v":{"v":0,"d":"0.0"}},{"v":0,"d":"0.0"},{"$nulls":3},{"$f":"IF(ISNA($H398),0,zeitausschnitt($G398,$H398,$L398,P$9,P$10))","v":0},{"$f":"IF(ISNA($H398),0,zeitausschnitt($G398,$H398,$L398,Q$9,Q$10))","v":0},0,0,0,0,0,0,0,0,0,0,0,0,0,0,0,0,0,0,0]
[29000,{"$f":"B398","v":29300},{"$f":"C398+1","v":29302},null,"Entwicklung",{"$f":"OFFSET(F399,-13,0)&\" \"&OFFSET(F399,-2,0)&\" \"&INDIRECT(OFFSET(F399,-13,0)&\"!A5\")","v":"Leer Entwicklung Entwicklung"},{"$f":"G398","v":{"$error":"#N/A"}},{"$f":"H398","v":{"$error":"#N/A"}},{"$f":"\"Aus Top Down \"&OFFSET(I399,-13,-3)","v":"Aus Top Down Leer"},{"$f":"IF(ISNA(H399),0,1)","v":{"v":0,"d":"0.000"}},{"$f":"INDIRECT(\"'\"&OFFSET(K399,-13,-5)&\"'!D5\")","v":{"v":0,"d":"0.0"}},{"v":0,"d":"0.0"},{"$nulls":3},{"$f":"IF(ISNA($H399),0,zeitausschnitt($G399,$H399,$L399,P$9,P$10))","v":0},0,0,0,0,0,0,0,0,0,0,0,0,0,0,0,0,0,0,0,0]
[29000,{"$f":"B399","v":29300},{"$f":"C399+1","v":29303},null,"Test",{"$f":"OFFSET(F400,-14,0)&\" \"&OFFSET(F400,-3,0)&\" \"&INDIRECT(OFFSET(F400,-14,0)&\"!A6\")","v":"Leer Entwicklung Test"},{"$f":"G399","v":{"$error":"#N/A"}},{"$f":"H399","v":{"$error":"#N/A"}},{"$f":"\"Aus Top Down \"&OFFSET(I400,-14,-3)","v":"Aus Top Down Leer"},{"$f":"IF(ISNA(H400),0,1)","v":{"v":0,"d":"0.000"}},{"$f":"INDIRECT(\"'\"&OFFSET(K400,-14,-5)&\"'!D6\")","v":{"v":0,"d":"0.0"}},{"v":0,"d":"0.0"},{"$nulls":3},0,0,0,0,0,0,0,0,0,0,0,0,0,0,0,0,0,0,0,0,0]
[29000,{"$nulls":10},""]
[29000,{"$f":"B397+100","v":29400},{"$nulls":3},{"$f":"INDIRECT(OFFSET(F402,-16,0)&\"!E1\")","v":"Pflege"},{"$f":"MIN(G403:G405)","v":{"$error":"#N/A"}},{"$f":"MAX(H403:H405)","v":{"$error":"#N/A"}},{"$nulls":3},"",{"$f":"SUMIF(B$12:B$519,B402,L$12:L$519)","v":{"v":0,"d":"0.0"}}]
[29000,{"$f":"B402","v":29400},{"$f":"B402+1","v":29401},null,"PL",{"$f":"OFFSET(F403,-17,0)&\" \"&OFFSET(F403,-1,0)&\" \"&INDIRECT(OFFSET(F403,-17,0)&\"!A4\")","v":"Leer Pflege Projektleitung"},{"$f":"VLOOKUP(OFFSET(G403,-17,-1),Projektübersicht,6,0)","v":{"$error":"#N/A"}},{"$f":"VLOOKUP(OFFSET(H403,-17,-2),Projektübersicht,7,0)","v":{"$error":"#N/A"}},{"$f":"\"Aus Top Down \"&OFFSET(I403,-17,-3)","v":"Aus Top Down Leer"},{"$f":"IF(ISNA(H403),0,1)","v":{"v":0,"d":"0.000"}},{"$f":"INDIRECT(\"'\"&OFFSET(K403,-17,-5)&\"'!E4\")","v":{"v":0,"d":"0.0"}},{"v":0,"d":"0.0"},{"$nulls":3},{"$f":"IF(ISNA($H403),0,zeitausschnitt($G403,$H403,$L403,P$9,P$10))","v":0},{"$f":"IF(ISNA($H403),0,zeitausschnitt($G403,$H403,$L403,Q$9,Q$10))","v":0},0,0,0,0,0,0,0,0,0,0,0,0,0,0,0,0,0,0,0]
[29000,{"$f":"B403","v":29400},{"$f":"C403+1","v":29402},null,"Entwicklung",{"$f":"OFFSET(F404,-18,0)&\" \"&OFFSET(F404,-2,0)&\" \"&INDIRECT(OFFSET(F404,-18,0)&\"!A5\")","v":"Leer Pflege Entwicklung"},{"$f":"G403","v":{"$error":"#N/A"}},{"$f":"H403","v":{"$error":"#N/A"}},{"$f":"\"Aus Top Down \"&OFFSET(I404,-18,-3)","v":"Aus Top Down Leer"},{"$f":"IF(ISNA(H404),0,1)","v":{"v":0,"d":"0.000"}},{"$f":"INDIRECT(\"'\"&OFFSET(K404,-18,-5)&\"'!E5\")","v":{"v":0,"d":"0.0"}},{"v":0,"d":"0.0"},{"$nulls":3},{"$f":"IF(ISNA($H404),0,zeitausschnitt($G404,$H404,$L404,P$9,P$10))","v":0},0,0,0,0,0,0,0,0,0,0,0,0,0,0,0,0,0,0,0,0]
[29000,{"$f":"B404","v":29400},{"$f":"C404+1","v":29403},null,"Test",{"$f":"OFFSET(F405,-19,0)&\" \"&OFFSET(F405,-3,0)&\" \"&INDIRECT(OFFSET(F405,-19,0)&\"!A6\")","v":"Leer Pflege Test"},{"$f":"G404","v":{"$error":"#N/A"}},{"$f":"H404","v":{"$error":"#N/A"}},{"$f":"\"Aus Top Down \"&OFFSET(I405,-19,-3)","v":"Aus Top Down Leer"},{"$f":"IF(ISNA(H405),0,1)","v":{"v":0,"d":"0.000"}},{"$f":"INDIRECT(\"'\"&OFFSET(K405,-19,-5)&\"'!E6\")","v":{"v":0,"d":"0.0"}},{"v":0,"d":"0.0"},{"$nulls":3},0,0,0,0,0,0,0,0,0,0,0,0,0,0,0,0,0,0,0,0,0]
[29000,{"$nulls":10},""]
[{"$nulls":11},""]
[{"$f":"A386+1000","v":30000},{"$nulls":4},{"$f":"INDIRECT(CONCATENATE(\"Übersicht!C\",TEXT((A408-10000)/1000,0)))","v":"Leer"},{"$f":"MIN(G409:G423)","v":{"$error":"#N/A"}},{"$f":"MAX(H409:H423)","v":{"$error":"#N/A"}},{"$nulls":3},"",{"$f":"SUMIF(A$12:A$519,A408,L$12:L$519)","v":{"v":0,"d":"0.0"}},null,{"$f":"F408","v":"Leer"},{"$f":"SUM(P410:P427)","v":0},{"$f":"SUM(Q410:Q427)","v":0},0,0,0,0,0,0,0,0,0,0,0,0,0,0,0,0,0,0,0]
[{"$f":"A408","v":30000},{"$f":"A408+100","v":30100},{"$nulls":3},{"$f":"INDIRECT(OFFSET(F409,-1,0)&\"!B1\")","v":"Studie"},{"$f":"MIN(G410:G412)","v":"00:00:00"},{"$f":"MAX(H410:H412)","v":{"$error":"#N/A"}},{"$nulls":3},"",{"$f":"SUMIF(B$12:B$519,B409,L$12:L$519)","v":{"v":0,"d":"0.0"}}]
[{"$f":"A409","v":30000},{"$f":"B409","v":30100},{"$f":"B409+1","v":30101},null,"PL",{"$f":"OFFSET(F410,-2,0)&\" \"&OFFSET(F410,-1,0)&\" \"&INDIRECT(OFFSET(F410,-2,0)&\"!A4\")","v":"Leer Studie Projektleitung"},{"$f":"VLOOKUP(OFFSET(G410,-2,-1),Projektübersicht,3,0)","v":"00:00:00"},{"$f":"VLOOKUP(OFFSET(H410,-2,-2),Projektübersicht,4,0)","v":{"$error":"#N/A"}},{"$f":"\"Aus Top Down \"&OFFSET(I410,-2,-3)","v":"Aus Top Down Leer"},{"$f":"IF(ISNA(H410),0,1)","v":{"v":0,"d":"0.000"}},{"$f":"INDIRECT(\"'\"&OFFSET(K410,-2,-5)&\"'!B4\")","v":{"v":0,"d":"0.0"}},{"v":0,"d":"0.0"},{"$nulls":3},{"$f":"IF(ISNA($H410),0,zeitausschnitt($G410,$H410,$L410,P$9,P$10))","v":0},{"$f":"IF(ISNA($H410),0,zeitausschnitt($G410,$H410,$L410,Q$9,Q$10))","v":0},0,0,0,0,0,0,0,0,0,0,0,0,0,0,0,0,0,0,0]
[{"$f":"A410","v":30000},{"$f":"B410","v":30100},{"$f":"C410+1","v":30102},null,"Entwicklung",{"$f":"OFFSET(F411,-3,0)&\" \"&OFFSET(F411,-2,0)&\" \"&INDIRECT(OFFSET(F411,-3,0)&\"!A5\")","v":"Leer Studie Entwicklung"},{"$f":"G410","v":"00:00:00"},{"$f":"H410","v":{"$error":"#N/A"}},{"$f":"\"Aus Top Down \"&OFFSET(I411,-3,-3)","v":"Aus Top Down Leer"},{"$f":"IF(ISNA(H411),0,1)","v":{"v":0,"d":"0.000"}},{"$f":"INDIRECT(\"'\"&OFFSET(K411,-3,-5)&\"'!B5\")","v":{"v":0,"d":"0.0"}},{"v":0,"d":"0.0"},{"$nulls":3},{"$f":"IF(ISNA($H411),0,zeitausschnitt($G411,$H411,$L411,P$9,P$10))","v":0},0,0,0,0,0,0,0,0,0,0,0,0,0,0,0,0,0,0,0,0]
[30000,{"$f":"B411","v":30100},{"$f":"C411+1","v":30103},null,"Test",{"$f":"OFFSET(F412,-4,0)&\" \"&OFFSET(F412,-3,0)&\" \"&INDIRECT(OFFSET(F412,-4,0)&\"!A6\")","v":"Leer Studie Test"},{"$f":"G411","v":"00:00:00"},{"$f":"H411","v":{"$error":"#N/A"}},{"$f":"\"Aus Top Down \"&OFFSET(I412,-4,-3)","v":"Aus Top Down Leer"},{"$f":"IF(ISNA(H412),0,1)","v":{"v":0,"d":"0.000"}},{"$f":"INDIRECT(\"'\"&OFFSET(K412,-4,-5)&\"'!B6\")","v":{"v":0,"d":"0.0"}},{"v":0,"d":"0.0"},{"$nulls":3},0,0,0,0,0,0,0,0,0,0,0,0,0,0,0,0,0,0,0,0,0]
[30000,{"$nulls":10},""]
[30000,{"$f":"B409+100","v":30200},{"$nulls":3},{"$f":"INDIRECT(OFFSET(F414,-6,0)&\"!C1\")","v":"Konzept "},{"$f":"MIN(G415:G417)","v":{"$error":"#N/A"}},{"$f":"MAX(H415:H417)","v":{"$error":"#N/A"}},{"$nulls":3},"",{"$f":"SUMIF(B$12:B$519,B414,L$12:L$519)","v":{"v":0,"d":"0.0"}}]
[30000,{"$f":"B414","v":30200},{"$f":"B414+1","v":30201},null,"PL",{"$f":"OFFSET(F415,-7,0)&\" \"&OFFSET(F415,-1,0)&\" \"&INDIRECT(OFFSET(F415,-7,0)&\"!A4\")","v":"Leer Konzept  Projektleitung"},{"$f":"VLOOKUP(OFFSET(G415,-7,-1),Projektübersicht,4,0)","v":{"$error":"#N/A"}},{"$f":"VLOOKUP(OFFSET(H415,-7,-2),Projektübersicht,5,0)","v":{"$error":"#N/A"}},{"$f":"\"Aus Top Down \"&OFFSET(I415,-7,-3)","v":"Aus Top Down Leer"},{"$f":"IF(ISNA(H415),0,1)","v":{"v":0,"d":"0.000"}},{"$f":"INDIRECT(\"'\"&OFFSET(K415,-7,-5)&\"'!C4\")","v":{"v":0,"d":"0.0"}},{"v":0,"d":"0.0"},{"$nulls":3},{"$f":"IF(ISNA($H415),0,zeitausschnitt($G415,$H415,$L415,P$9,P$10))","v":0},{"$f":"IF(ISNA($H415),0,zeitausschnitt($G415,$H415,$L415,Q$9,Q$10))","v":0},0,0,0,0,0,0,0,0,0,0,0,0,0,0,0,0,0,0,0]
[30000,{"$f":"B415","v":30200},{"$f":"C415+1","v":30202},null,"Entwicklung",{"$f":"OFFSET(F416,-8,0)&\" \"&OFFSET(F416,-2,0)&\" \"&INDIRECT(OFFSET(F416,-8,0)&\"!A5\")","v":"Leer Konzept  Entwicklung"},{"$f":"G415","v":{"$error":"#N/A"}},{"$f":"H415","v":{"$error":"#N/A"}},{"$f":"\"Aus Top Down \"&OFFSET(I416,-8,-3)","v":"Aus Top Down Leer"},{"$f":"IF(ISNA(H416),0,1)","v":{"v":0,"d":"0.000"}},{"$f":"INDIRECT(\"'\"&OFFSET(K416,-8,-5)&\"'!C5\")","v":{"v":0,"d":"0.0"}},{"v":0,"d":"0.0"},{"$nulls":3},{"$f":"IF(ISNA($H416),0,zeitausschnitt($G416,$H416,$L416,P$9,P$10))","v":0},0,0,0,0,0,0,0,0,0,0,0,0,0,0,0,0,0,0,0,0]
[30000,{"$f":"B416","v":30200},{"$f":"C416+1","v":30203},null,"Test",{"$f":"OFFSET(F417,-9,0)&\" \"&OFFSET(F417,-3,0)&\" \"&INDIRECT(OFFSET(F417,-9,0)&\"!A6\")","v":"Leer Konzept  Test"},{"$f":"G416","v":{"$error":"#N/A"}},{"$f":"H416","v":{"$error":"#N/A"}},{"$f":"\"Aus Top Down \"&OFFSET(I417,-9,-3)","v":"Aus Top Down Leer"},{"$f":"IF(ISNA(H417),0,1)","v":{"v":0,"d":"0.000"}},{"$f":"INDIRECT(\"'\"&OFFSET(K417,-9,-5)&\"'!C6\")","v":{"v":0,"d":"0.0"}},{"v":0,"d":"0.0"},{"$nulls":3},0,0,0,0,0,0,0,0,0,0,0,0,0,0,0,0,0,0,0,0,0]
[30000,{"$nulls":10},""]
[30000,{"$f":"B414+100","v":30300},{"$nulls":3},{"$f":"INDIRECT(OFFSET(F419,-11,0)&\"!D1\")","v":"Entwicklung"},{"$f":"MIN(G420:G422)","v":{"$error":"#N/A"}},{"$f":"MAX(H420:H422)","v":{"$error":"#N/A"}},{"$nulls":3},"",{"$f":"SUMIF(B$12:B$519,B419,L$12:L$519)","v":{"v":0,"d":"0.0"}}]
[30000,{"$f":"B419","v":30300},{"$f":"B419+1","v":30301},null,"PL",{"$f":"OFFSET(F420,-12,0)&\" \"&OFFSET(F420,-1,0)&\" \"&INDIRECT(OFFSET(F420,-12,0)&\"!A4\")","v":"Leer Entwicklung Projektleitung"},{"$f":"VLOOKUP(OFFSET(G420,-12,-1),Projektübersicht,5,0)","v":{"$error":"#N/A"}},{"$f":"VLOOKUP(OFFSET(H420,-12,-2),Projektübersicht,6,0)","v":{"$error":"#N/A"}},{"$f":"\"Aus Top Down \"&OFFSET(I420,-12,-3)","v":"Aus Top Down Leer"},{"$f":"IF(ISNA(H420),0,1)","v":{"v":0,"d":"0.000"}},{"$f":"INDIRECT(\"'\"&OFFSET(K420,-12,-5)&\"'!D4\")","v":{"v":0,"d":"0.0"}},{"v":0,"d":"0.0"},{"$nulls":3},{"$f":"IF(ISNA($H420),0,zeitausschnitt($G420,$H420,$L420,P$9,P$10))","v":0},{"$f":"IF(ISNA($H420),0,zeitausschnitt($G420,$H420,$L420,Q$9,Q$10))","v":0},0,0,0,0,0,0,0,0,0,0,0,0,0,0,0,0,0,0,0]
[30000,{"$f":"B420","v":30300},{"$f":"C420+1","v":30302},null,"Entwicklung",{"$f":"OFFSET(F421,-13,0)&\" \"&OFFSET(F421,-2,0)&\" \"&INDIRECT(OFFSET(F421,-13,0)&\"!A5\")","v":"Leer Entwicklung Entwicklung"},{"$f":"G420","v":{"$error":"#N/A"}},{"$f":"H420","v":{"$error":"#N/A"}},{"$f":"\"Aus Top Down \"&OFFSET(I421,-13,-3)","v":"Aus Top Down Leer"},{"$f":"IF(ISNA(H421),0,1)","v":{"v":0,"d":"0.000"}},{"$f":"INDIRECT(\"'\"&OFFSET(K421,-13,-5)&\"'!D5\")","v":{"v":0,"d":"0.0"}},{"v":0,"d":"0.0"},{"$nulls":3},{"$f":"IF(ISNA($H421),0,zeitausschnitt($G421,$H421,$L421,P$9,P$10))","v":0},0,0,0,0,0,0,0,0,0,0,0,0,0,0,0,0,0,0,0,0]
[30000,{"$f":"B421","v":30300},{"$f":"C421+1","v":30303},null,"Test",{"$f":"OFFSET(F422,-14,0)&\" \"&OFFSET(F422,-3,0)&\" \"&INDIRECT(OFFSET(F422,-14,0)&\"!A6\")","v":"Leer Entwicklung Test"},{"$f":"G421","v":{"$error":"#N/A"}},{"$f":"H421","v":{"$error":"#N/A"}},{"$f":"\"Aus Top Down \"&OFFSET(I422,-14,-3)","v":"Aus Top Down Leer"},{"$f":"IF(ISNA(H422),0,1)","v":{"v":0,"d":"0.000"}},{"$f":"INDIRECT(\"'\"&OFFSET(K422,-14,-5)&\"'!D6\")","v":{"v":0,"d":"0.0"}},{"v":0,"d":"0.0"},{"$nulls":3},0,0,0,0,0,0,0,0,0,0,0,0,0,0,0,0,0,0,0,0,0]
[30000,{"$nulls":10},""]
[30000,{"$f":"B419+100","v":30400},{"$nulls":3},{"$f":"INDIRECT(OFFSET(F424,-16,0)&\"!E1\")","v":"Pflege"},{"$f":"MIN(G425:G427)","v":{"$error":"#N/A"}},{"$f":"MAX(H425:H427)","v":{"$error":"#N/A"}},{"$nulls":3},"",{"$f":"SUMIF(B$12:B$519,B424,L$12:L$519)","v":{"v":0,"d":"0.0"}}]
[30000,{"$f":"B424","v":30400},{"$f":"B424+1","v":30401},null,"PL",{"$f":"OFFSET(F425,-17,0)&\" \"&OFFSET(F425,-1,0)&\" \"&INDIRECT(OFFSET(F425,-17,0)&\"!A4\")","v":"Leer Pflege Projektleitung"},{"$f":"VLOOKUP(OFFSET(G425,-17,-1),Projektübersicht,6,0)","v":{"$error":"#N/A"}},{"$f":"VLOOKUP(OFFSET(H425,-17,-2),Projektübersicht,7,0)","v":{"$error":"#N/A"}},{"$f":"\"Aus Top Down \"&OFFSET(I425,-17,-3)","v":"Aus Top Down Leer"},{"$f":"IF(ISNA(H425),0,1)","v":{"v":0,"d":"0.000"}},{"$f":"INDIRECT(\"'\"&OFFSET(K425,-17,-5)&\"'!E4\")","v":{"v":0,"d":"0.0"}},{"v":0,"d":"0.0"},{"$nulls":3},{"$f":"IF(ISNA($H425),0,zeitausschnitt($G425,$H425,$L425,P$9,P$10))","v":0},{"$f":"IF(ISNA($H425),0,zeitausschnitt($G425,$H425,$L425,Q$9,Q$10))","v":0},0,0,0,0,0,0,0,0,0,0,0,0,0,0,0,0,0,0,0]
[30000,{"$f":"B425","v":30400},{"$f":"C425+1","v":30402},null,"Entwicklung",{"$f":"OFFSET(F426,-18,0)&\" \"&OFFSET(F426,-2,0)&\" \"&INDIRECT(OFFSET(F426,-18,0)&\"!A5\")","v":"Leer Pflege Entwicklung"},{"$f":"G425","v":{"$error":"#N/A"}},{"$f":"H425","v":{"$error":"#N/A"}},{"$f":"\"Aus Top Down \"&OFFSET(I426,-18,-3)","v":"Aus Top Down Leer"},{"$f":"IF(ISNA(H426),0,1)","v":{"v":0,"d":"0.000"}},{"$f":"INDIRECT(\"'\"&OFFSET(K426,-18,-5)&\"'!E5\")","v":{"v":0,"d":"0.0"}},{"v":0,"d":"0.0"},{"$nulls":3},{"$f":"IF(ISNA($H426),0,zeitausschnitt($G426,$H426,$L426,P$9,P$10))","v":0},0,0,0,0,0,0,0,0,0,0,0,0,0,0,0,0,0,0,0,0]
[30000,{"$f":"B426","v":30400},{"$f":"C426+1","v":30403},null,"Test",{"$f":"OFFSET(F427,-19,0)&\" \"&OFFSET(F427,-3,0)&\" \"&INDIRECT(OFFSET(F427,-19,0)&\"!A6\")","v":"Leer Pflege Test"},{"$f":"G426","v":{"$error":"#N/A"}},{"$f":"H426","v":{"$error":"#N/A"}},{"$f":"\"Aus Top Down \"&OFFSET(I427,-19,-3)","v":"Aus Top Down Leer"},{"$f":"IF(ISNA(H427),0,1)","v":{"v":0,"d":"0.000"}},{"$f":"INDIRECT(\"'\"&OFFSET(K427,-19,-5)&\"'!E6\")","v":{"v":0,"d":"0.0"}},{"v":0,"d":"0.0"},{"$nulls":3},0,0,0,0,0,0,0,0,0,0,0,0,0,0,0,0,0,0,0,0,0]
[30000,{"$nulls":10},""]
[{"$nulls":11},{"$f":"IF(AND(J429<>\"\",K429<>\"\"),J429*K429,\"\")","v":""}]
[{"$f":"A408+1000","v":31000},{"$nulls":4},{"$f":"INDIRECT(CONCATENATE(\"Übersicht!C\",TEXT((A430-10000)/1000,0)))","v":"Leer"},{"$f":"MIN(G431:G445)","v":{"$error":"#N/A"}},{"$f":"MAX(H431:H445)","v":{"$error":"#N/A"}},{"$nulls":3},"",{"$f":"SUMIF(A$12:A$519,A430,L$12:L$519)","v":{"v":0,"d":"0.0"}},null,{"$f":"F430","v":"Leer"},{"$f":"SUM(P432:P449)","v":0},{"$f":"SUM(Q432:Q449)","v":0},0,0,0,0,0,0,0,0,0,0,0,0,0,0,0,0,0,0,0]
[{"$f":"A430","v":31000},{"$f":"A430+100","v":31100},{"$nulls":3},{"$f":"INDIRECT(OFFSET(F431,-1,0)&\"!B1\")","v":"Studie"},{"$f":"MIN(G432:G434)","v":"00:00:00"},{"$f":"MAX(H432:H434)","v":{"$error":"#N/A"}},{"$nulls":3},"",{"$f":"SUMIF(B$12:B$519,B431,L$12:L$519)","v":{"v":0,"d":"0.0"}}]
[{"$f":"A431","v":31000},{"$f":"B431","v":31100},{"$f":"B431+1","v":31101},null,"PL",{"$f":"OFFSET(F432,-2,0)&\" \"&OFFSET(F432,-1,0)&\" \"&INDIRECT(OFFSET(F432,-2,0)&\"!A4\")","v":"Leer Studie Projektleitung"},{"$f":"VLOOKUP(OFFSET(G432,-2,-1),Projektübersicht,3,0)","v":"00:00:00"},{"$f":"VLOOKUP(OFFSET(H432,-2,-2),Projektübersicht,4,0)","v":{"$error":"#N/A"}},{"$f":"\"Aus Top Down \"&OFFSET(I432,-2,-3)","v":"Aus Top Down Leer"},{"$f":"IF(ISNA(H432),0,1)","v":{"v":0,"d":"0.000"}},{"$f":"INDIRECT(\"'\"&OFFSET(K432,-2,-5)&\"'!B4\")","v":{"v":0,"d":"0.0"}},{"v":0,"d":"0.0"},{"$nulls":3},{"$f":"IF(ISNA($H432),0,zeitausschnitt($G432,$H432,$L432,P$9,P$10))","v":0},{"$f":"IF(ISNA($H432),0,zeitausschnitt($G432,$H432,$L432,Q$9,Q$10))","v":0},0,0,0,0,0,0,0,0,0,0,0,0,0,0,0,0,0,0,0]
[{"$f":"A432","v":31000},{"$f":"B432","v":31100},{"$f":"C432+1","v":31102},null,"Entwicklung",{"$f":"OFFSET(F433,-3,0)&\" \"&OFFSET(F433,-2,0)&\" \"&INDIRECT(OFFSET(F433,-3,0)&\"!A5\")","v":"Leer Studie Entwicklung"},{"$f":"G432","v":"00:00:00"},{"$f":"H432","v":{"$error":"#N/A"}},{"$f":"\"Aus Top Down \"&OFFSET(I433,-3,-3)","v":"Aus Top Down Leer"},{"$f":"IF(ISNA(H433),0,1)","v":{"v":0,"d":"0.000"}},{"$f":"INDIRECT(\"'\"&OFFSET(K433,-3,-5)&\"'!B5\")","v":{"v":0,"d":"0.0"}},{"v":0,"d":"0.0"},{"$nulls":3},{"$f":"IF(ISNA($H433),0,zeitausschnitt($G433,$H433,$L433,P$9,P$10))","v":0},0,0,0,0,0,0,0,0,0,0,0,0,0,0,0,0,0,0,0,0]
[31000,{"$f":"B433","v":31100},{"$f":"C433+1","v":31103},null,"Test",{"$f":"OFFSET(F434,-4,0)&\" \"&OFFSET(F434,-3,0)&\" \"&INDIRECT(OFFSET(F434,-4,0)&\"!A6\")","v":"Leer Studie Test"},{"$f":"G433","v":"00:00:00"},{"$f":"H433","v":{"$error":"#N/A"}},{"$f":"\"Aus Top Down \"&OFFSET(I434,-4,-3)","v":"Aus Top Down Leer"},{"$f":"IF(ISNA(H434),0,1)","v":{"v":0,"d":"0.000"}},{"$f":"INDIRECT(\"'\"&OFFSET(K434,-4,-5)&\"'!B6\")","v":{"v":0,"d":"0.0"}},{"v":0,"d":"0.0"},{"$nulls":3},0,0,0,0,0,0,0,0,0,0,0,0,0,0,0,0,0,0,0,0,0]
[31000,{"$nulls":10},""]
[31000,{"$f":"B431+100","v":31200},{"$nulls":3},{"$f":"INDIRECT(OFFSET(F436,-6,0)&\"!C1\")","v":"Konzept "},{"$f":"MIN(G437:G439)","v":{"$error":"#N/A"}},{"$f":"MAX(H437:H439)","v":{"$error":"#N/A"}},{"$nulls":3},"",{"$f":"SUMIF(B$12:B$519,B436,L$12:L$519)","v":{"v":0,"d":"0.0"}}]
[31000,{"$f":"B436","v":31200},{"$f":"B436+1","v":31201},null,"PL",{"$f":"OFFSET(F437,-7,0)&\" \"&OFFSET(F437,-1,0)&\" \"&INDIRECT(OFFSET(F437,-7,0)&\"!A4\")","v":"Leer Konzept  Projektleitung"},{"$f":"VLOOKUP(OFFSET(G437,-7,-1),Projektübersicht,4,0)","v":{"$error":"#N/A"}},{"$f":"VLOOKUP(OFFSET(H437,-7,-2),Projektübersicht,5,0)","v":{"$error":"#N/A"}},{"$f":"\"Aus Top Down \"&OFFSET(I437,-7,-3)","v":"Aus Top Down Leer"},{"$f":"IF(ISNA(H437),0,1)","v":{"v":0,"d":"0.000"}},{"$f":"INDIRECT(\"'\"&OFFSET(K437,-7,-5)&\"'!C4\")","v":{"v":0,"d":"0.0"}},{"v":0,"d":"0.0"},{"$nulls":3},{"$f":"IF(ISNA($H437),0,zeitausschnitt($G437,$H437,$L437,P$9,P$10))","v":0},{"$f":"IF(ISNA($H437),0,zeitausschnitt($G437,$H437,$L437,Q$9,Q$10))","v":0},0,0,0,0,0,0,0,0,0,0,0,0,0,0,0,0,0,0,0]
[31000,{"$f":"B437","v":31200},{"$f":"C437+1","v":31202},null,"Entwicklung",{"$f":"OFFSET(F438,-8,0)&\" \"&OFFSET(F438,-2,0)&\" \"&INDIRECT(OFFSET(F438,-8,0)&\"!A5\")","v":"Leer Konzept  Entwicklung"},{"$f":"G437","v":{"$error":"#N/A"}},{"$f":"H437","v":{"$error":"#N/A"}},{"$f":"\"Aus Top Down \"&OFFSET(I438,-8,-3)","v":"Aus Top Down Leer"},{"$f":"IF(ISNA(H438),0,1)","v":{"v":0,"d":"0.000"}},{"$f":"INDIRECT(\"'\"&OFFSET(K438,-8,-5)&\"'!C5\")","v":{"v":0,"d":"0.0"}},{"v":0,"d":"0.0"},{"$nulls":3},{"$f":"IF(ISNA($H438),0,zeitausschnitt($G438,$H438,$L438,P$9,P$10))","v":0},0,0,0,0,0,0,0,0,0,0,0,0,0,0,0,0,0,0,0,0]
[31000,{"$f":"B438","v":31200},{"$f":"C438+1","v":31203},null,"Test",{"$f":"OFFSET(F439,-9,0)&\" \"&OFFSET(F439,-3,0)&\" \"&INDIRECT(OFFSET(F439,-9,0)&\"!A6\")","v":"Leer Konzept  Test"},{"$f":"G438","v":{"$error":"#N/A"}},{"$f":"H438","v":{"$error":"#N/A"}},{"$f":"\"Aus Top Down \"&OFFSET(I439,-9,-3)","v":"Aus Top Down Leer"},{"$f":"IF(ISNA(H439),0,1)","v":{"v":0,"d":"0.000"}},{"$f":"INDIRECT(\"'\"&OFFSET(K439,-9,-5)&\"'!C6\")","v":{"v":0,"d":"0.0"}},{"v":0,"d":"0.0"},{"$nulls":3},0,0,0,0,0,0,0,0,0,0,0,0,0,0,0,0,0,0,0,0,0]
[31000,{"$nulls":10},""]
[31000,{"$f":"B436+100","v":31300},{"$nulls":3},{"$f":"INDIRECT(OFFSET(F441,-11,0)&\"!D1\")","v":"Entwicklung"},{"$f":"MIN(G442:G444)","v":{"$error":"#N/A"}},{"$f":"MAX(H442:H444)","v":{"$error":"#N/A"}},{"$nulls":3},"",{"$f":"SUMIF(B$12:B$519,B441,L$12:L$519)","v":{"v":0,"d":"0.0"}}]
[31000,{"$f":"B441","v":31300},{"$f":"B441+1","v":31301},null,"PL",{"$f":"OFFSET(F442,-12,0)&\" \"&OFFSET(F442,-1,0)&\" \"&INDIRECT(OFFSET(F442,-12,0)&\"!A4\")","v":"Leer Entwicklung Projektleitung"},{"$f":"VLOOKUP(OFFSET(G442,-12,-1),Projektübersicht,5,0)","v":{"$error":"#N/A"}},{"$f":"VLOOKUP(OFFSET(H442,-12,-2),Projektübersicht,6,0)","v":{"$error":"#N/A"}},{"$f":"\"Aus Top Down \"&OFFSET(I442,-12,-3)","v":"Aus Top Down Leer"},{"$f":"IF(ISNA(H442),0,1)","v":{"v":0,"d":"0.000"}},{"$f":"INDIRECT(\"'\"&OFFSET(K442,-12,-5)&\"'!D4\")","v":{"v":0,"d":"0.0"}},{"v":0,"d":"0.0"},{"$nulls":3},{"$f":"IF(ISNA($H442),0,zeitausschnitt($G442,$H442,$L442,P$9,P$10))","v":0},{"$f":"IF(ISNA($H442),0,zeitausschnitt($G442,$H442,$L442,Q$9,Q$10))","v":0},0,0,0,0,0,0,0,0,0,0,0,0,0,0,0,0,0,0,0]
[31000,{"$f":"B442","v":31300},{"$f":"C442+1","v":31302},null,"Entwicklung",{"$f":"OFFSET(F443,-13,0)&\" \"&OFFSET(F443,-2,0)&\" \"&INDIRECT(OFFSET(F443,-13,0)&\"!A5\")","v":"Leer Entwicklung Entwicklung"},{"$f":"G442","v":{"$error":"#N/A"}},{"$f":"H442","v":{"$error":"#N/A"}},{"$f":"\"Aus Top Down \"&OFFSET(I443,-13,-3)","v":"Aus Top Down Leer"},{"$f":"IF(ISNA(H443),0,1)","v":{"v":0,"d":"0.000"}},{"$f":"INDIRECT(\"'\"&OFFSET(K443,-13,-5)&\"'!D5\")","v":{"v":0,"d":"0.0"}},{"v":0,"d":"0.0"},{"$nulls":3},{"$f":"IF(ISNA($H443),0,zeitausschnitt($G443,$H443,$L443,P$9,P$10))","v":0},0,0,0,0,0,0,0,0,0,0,0,0,0,0,0,0,0,0,0,0]
[31000,{"$f":"B443","v":31300},{"$f":"C443+1","v":31303},null,"Test",{"$f":"OFFSET(F444,-14,0)&\" \"&OFFSET(F444,-3,0)&\" \"&INDIRECT(OFFSET(F444,-14,0)&\"!A6\")","v":"Leer Entwicklung Test"},{"$f":"G443","v":{"$error":"#N/A"}},{"$f":"H443","v":{"$error":"#N/A"}},{"$f":"\"Aus Top Down \"&OFFSET(I444,-14,-3)","v":"Aus Top Down Leer"},{"$f":"IF(ISNA(H444),0,1)","v":{"v":0,"d":"0.000"}},{"$f":"INDIRECT(\"'\"&OFFSET(K444,-14,-5)&\"'!D6\")","v":{"v":0,"d":"0.0"}},{"v":0,"d":"0.0"},{"$nulls":3},0,0,0,0,0,0,0,0,0,0,0,0,0,0,0,0,0,0,0,0,0]
[31000,{"$nulls":10},""]
[31000,{"$f":"B441+100","v":31400},{"$nulls":3},{"$f":"INDIRECT(OFFSET(F446,-16,0)&\"!E1\")","v":"Pflege"},{"$f":"MIN(G447:G449)","v":{"$error":"#N/A"}},{"$f":"MAX(H447:H449)","v":{"$error":"#N/A"}},{"$nulls":3},"",{"$f":"SUMIF(B$12:B$519,B446,L$12:L$519)","v":{"v":0,"d":"0.0"}}]
[31000,{"$f":"B446","v":31400},{"$f":"B446+1","v":31401},null,"PL",{"$f":"OFFSET(F447,-17,0)&\" \"&OFFSET(F447,-1,0)&\" \"&INDIRECT(OFFSET(F447,-17,0)&\"!A4\")","v":"Leer Pflege Projektleitung"},{"$f":"VLOOKUP(OFFSET(G447,-17,-1),Projektübersicht,6,0)","v":{"$error":"#N/A"}},{"$f":"VLOOKUP(OFFSET(H447,-17,-2),Projektübersicht,7,0)","v":{"$error":"#N/A"}},{"$f":"\"Aus Top Down \"&OFFSET(I447,-17,-3)","v":"Aus Top Down Leer"},{"$f":"IF(ISNA(H447),0,1)","v":{"v":0,"d":"0.000"}},{"$f":"INDIRECT(\"'\"&OFFSET(K447,-17,-5)&\"'!E4\")","v":{"v":0,"d":"0.0"}},{"v":0,"d":"0.0"},{"$nulls":3},{"$f":"IF(ISNA($H447),0,zeitausschnitt($G447,$H447,$L447,P$9,P$10))","v":0},{"$f":"IF(ISNA($H447),0,zeitausschnitt($G447,$H447,$L447,Q$9,Q$10))","v":0},0,0,0,0,0,0,0,0,0,0,0,0,0,0,0,0,0,0,0]
[31000,{"$f":"B447","v":31400},{"$f":"C447+1","v":31402},null,"Entwicklung",{"$f":"OFFSET(F448,-18,0)&\" \"&OFFSET(F448,-2,0)&\" \"&INDIRECT(OFFSET(F448,-18,0)&\"!A5\")","v":"Leer Pflege Entwicklung"},{"$f":"G447","v":{"$error":"#N/A"}},{"$f":"H447","v":{"$error":"#N/A"}},{"$f":"\"Aus Top Down \"&OFFSET(I448,-18,-3)","v":"Aus Top Down Leer"},{"$f":"IF(ISNA(H448),0,1)","v":{"v":0,"d":"0.000"}},{"$f":"INDIRECT(\"'\"&OFFSET(K448,-18,-5)&\"'!E5\")","v":{"v":0,"d":"0.0"}},{"v":0,"d":"0.0"},{"$nulls":3},{"$f":"IF(ISNA($H448),0,zeitausschnitt($G448,$H448,$L448,P$9,P$10))","v":0},0,0,0,0,0,0,0,0,0,0,0,0,0,0,0,0,0,0,0,0]
[31000,{"$f":"B448","v":31400},{"$f":"C448+1","v":31403},null,"Test",{"$f":"OFFSET(F449,-19,0)&\" \"&OFFSET(F449,-3,0)&\" \"&INDIRECT(OFFSET(F449,-19,0)&\"!A6\")","v":"Leer Pflege Test"},{"$f":"G448","v":{"$error":"#N/A"}},{"$f":"H448","v":{"$error":"#N/A"}},{"$f":"\"Aus Top Down \"&OFFSET(I449,-19,-3)","v":"Aus Top Down Leer"},{"$f":"IF(ISNA(H449),0,1)","v":{"v":0,"d":"0.000"}},{"$f":"INDIRECT(\"'\"&OFFSET(K449,-19,-5)&\"'!E6\")","v":{"v":0,"d":"0.0"}},{"v":0,"d":"0.0"},{"$nulls":3},0,0,0,0,0,0,0,0,0,0,0,0,0,0,0,0,0,0,0,0,0]
[31000,{"$nulls":10},""]
[{"$nulls":11},{"$f":"IF(AND(J451<>\"\",K451<>\"\"),J451*K451,\"\")","v":""}]
[{"$f":"A430+1000","v":32000},{"$nulls":4},{"$f":"INDIRECT(CONCATENATE(\"Übersicht!C\",TEXT((A452-10000)/1000,0)))","v":"Leer"},{"$f":"MIN(G453:G467)","v":{"$error":"#N/A"}},{"$f":"MAX(H453:H467)","v":{"$error":"#N/A"}},{"$nulls":3},"",{"$f":"SUMIF(A$12:A$519,A452,L$12:L$519)","v":{"v":0,"d":"0.0"}},null,{"$f":"F452","v":"Leer"},{"$f":"SUM(P454:P471)","v":0},{"$f":"SUM(Q454:Q471)","v":0},0,0,0,0,0,0,0,0,0,0,0,0,0,0,0,0,0,0,0]
[{"$f":"A452","v":32000},{"$f":"A452+100","v":32100},{"$nulls":3},{"$f":"INDIRECT(OFFSET(F453,-1,0)&\"!B1\")","v":"Studie"},{"$f":"MIN(G454:G456)","v":"00:00:00"},{"$f":"MAX(H454:H456)","v":{"$error":"#N/A"}},{"$nulls":3},"",{"$f":"SUMIF(B$12:B$519,B453,L$12:L$519)","v":{"v":0,"d":"0.0"}}]
[{"$f":"A453","v":32000},{"$f":"B453","v":32100},{"$f":"B453+1","v":32101},null,"PL",{"$f":"OFFSET(F454,-2,0)&\" \"&OFFSET(F454,-1,0)&\" \"&INDIRECT(OFFSET(F454,-2,0)&\"!A4\")","v":"Leer Studie Projektleitung"},{"$f":"VLOOKUP(OFFSET(G454,-2,-1),Projektübersicht,3,0)","v":"00:00:00"},{"$f":"VLOOKUP(OFFSET(H454,-2,-2),Projektübersicht,4,0)","v":{"$error":"#N/A"}},{"$f":"\"Aus Top Down \"&OFFSET(I454,-2,-3)","v":"Aus Top Down Leer"},{"$f":"IF(ISNA(H454),0,1)","v":{"v":0,"d":"0.000"}},{"$f":"INDIRECT(\"'\"&OFFSET(K454,-2,-5)&\"'!B4\")","v":{"v":0,"d":"0.0"}},{"v":0,"d":"0.0"},{"$nulls":3},{"$f":"IF(ISNA($H454),0,zeitausschnitt($G454,$H454,$L454,P$9,P$10))","v":0},{"$f":"IF(ISNA($H454),0,zeitausschnitt($G454,$H454,$L454,Q$9,Q$10))","v":0},0,0,0,0,0,0,0,0,0,0,0,0,0,0,0,0,0,0,0]
[{"$f":"A454","v":32000},{"$f":"B454","v":32100},{"$f":"C454+1","v":32102},null,"Entwicklung",{"$f":"OFFSET(F455,-3,0)&\" \"&OFFSET(F455,-2,0)&\" \"&INDIRECT(OFFSET(F455,-3,0)&\"!A5\")","v":"Leer Studie Entwicklung"},{"$f":"G454","v":"00:00:00"},{"$f":"H454","v":{"$error":"#N/A"}},{"$f":"\"Aus Top Down \"&OFFSET(I455,-3,-3)","v":"Aus Top Down Leer"},{"$f":"IF(ISNA(H455),0,1)","v":{"v":0,"d":"0.000"}},{"$f":"INDIRECT(\"'\"&OFFSET(K455,-3,-5)&\"'!B5\")","v":{"v":0,"d":"0.0"}},{"v":0,"d":"0.0"},{"$nulls":3},{"$f":"IF(ISNA($H455),0,zeitausschnitt($G455,$H455,$L455,P$9,P$10))","v":0},0,0,0,0,0,0,0,0,0,0,0,0,0,0,0,0,0,0,0,0]
[32000,{"$f":"B455","v":32100},{"$f":"C455+1","v":32103},null,"Test",{"$f":"OFFSET(F456,-4,0)&\" \"&OFFSET(F456,-3,0)&\" \"&INDIRECT(OFFSET(F456,-4,0)&\"!A6\")","v":"Leer Studie Test"},{"$f":"G455","v":"00:00:00"},{"$f":"H455","v":{"$error":"#N/A"}},{"$f":"\"Aus Top Down \"&OFFSET(I456,-4,-3)","v":"Aus Top Down Leer"},{"$f":"IF(ISNA(H456),0,1)","v":{"v":0,"d":"0.000"}},{"$f":"INDIRECT(\"'\"&OFFSET(K456,-4,-5)&\"'!B6\")","v":{"v":0,"d":"0.0"}},{"v":0,"d":"0.0"},{"$nulls":3},0,0,0,0,0,0,0,0,0,0,0,0,0,0,0,0,0,0,0,0,0]
[32000,{"$nulls":10},""]
[32000,{"$f":"B453+100","v":32200},{"$nulls":3},{"$f":"INDIRECT(OFFSET(F458,-6,0)&\"!C1\")","v":"Konzept "},{"$f":"MIN(G459:G461)","v":{"$error":"#N/A"}},{"$f":"MAX(H459:H461)","v":{"$error":"#N/A"}},{"$nulls":3},"",{"$f":"SUMIF(B$12:B$519,B458,L$12:L$519)","v":{"v":0,"d":"0.0"}}]
[32000,{"$f":"B458","v":32200},{"$f":"B458+1","v":32201},null,"PL",{"$f":"OFFSET(F459,-7,0)&\" \"&OFFSET(F459,-1,0)&\" \"&INDIRECT(OFFSET(F459,-7,0)&\"!A4\")","v":"Leer Konzept  Projektleitung"},{"$f":"VLOOKUP(OFFSET(G459,-7,-1),Projektübersicht,4,0)","v":{"$error":"#N/A"}},{"$f":"VLOOKUP(OFFSET(H459,-7,-2),Projektübersicht,5,0)","v":{"$error":"#N/A"}},{"$f":"\"Aus Top Down \"&OFFSET(I459,-7,-3)","v":"Aus Top Down Leer"},{"$f":"IF(ISNA(H459),0,1)","v":{"v":0,"d":"0.000"}},{"$f":"INDIRECT(\"'\"&OFFSET(K459,-7,-5)&\"'!C4\")","v":{"v":0,"d":"0.0"}},{"v":0,"d":"0.0"},{"$nulls":3},{"$f":"IF(ISNA($H459),0,zeitausschnitt($G459,$H459,$L459,P$9,P$10))","v":0},{"$f":"IF(ISNA($H459),0,zeitausschnitt($G459,$H459,$L459,Q$9,Q$10))","v":0},0,0,0,0,0,0,0,0,0,0,0,0,0,0,0,0,0,0,0]
[32000,{"$f":"B459","v":32200},{"$f":"C459+1","v":32202},null,"Entwicklung",{"$f":"OFFSET(F460,-8,0)&\" \"&OFFSET(F460,-2,0)&\" \"&INDIRECT(OFFSET(F460,-8,0)&\"!A5\")","v":"Leer Konzept  Entwicklung"},{"$f":"G459","v":{"$error":"#N/A"}},{"$f":"H459","v":{"$error":"#N/A"}},{"$f":"\"Aus Top Down \"&OFFSET(I460,-8,-3)","v":"Aus Top Down Leer"},{"$f":"IF(ISNA(H460),0,1)","v":{"v":0,"d":"0.000"}},{"$f":"INDIRECT(\"'\"&OFFSET(K460,-8,-5)&\"'!C5\")","v":{"v":0,"d":"0.0"}},{"v":0,"d":"0.0"},{"$nulls":3},{"$f":"IF(ISNA($H460),0,zeitausschnitt($G460,$H460,$L460,P$9,P$10))","v":0},0,0,0,0,0,0,0,0,0,0,0,0,0,0,0,0,0,0,0,0]
[32000,{"$f":"B460","v":32200},{"$f":"C460+1","v":32203},null,"Test",{"$f":"OFFSET(F461,-9,0)&\" \"&OFFSET(F461,-3,0)&\" \"&INDIRECT(OFFSET(F461,-9,0)&\"!A6\")","v":"Leer Konzept  Test"},{"$f":"G460","v":{"$error":"#N/A"}},{"$f":"H460","v":{"$error":"#N/A"}},{"$f":"\"Aus Top Down \"&OFFSET(I461,-9,-3)","v":"Aus Top Down Leer"},{"$f":"IF(ISNA(H461),0,1)","v":{"v":0,"d":"0.000"}},{"$f":"INDIRECT(\"'\"&OFFSET(K461,-9,-5)&\"'!C6\")","v":{"v":0,"d":"0.0"}},{"v":0,"d":"0.0"},{"$nulls":3},0,0,0,0,0,0,0,0,0,0,0,0,0,0,0,0,0,0,0,0,0]
[32000,{"$nulls":10},""]
[32000,{"$f":"B458+100","v":32300},{"$nulls":3},{"$f":"INDIRECT(OFFSET(F463,-11,0)&\"!D1\")","v":"Entwicklung"},{"$f":"MIN(G464:G466)","v":{"$error":"#N/A"}},{"$f":"MAX(H464:H466)","v":{"$error":"#N/A"}},{"$nulls":3},"",{"$f":"SUMIF(B$12:B$519,B463,L$12:L$519)","v":{"v":0,"d":"0.0"}}]
[32000,{"$f":"B463","v":32300},{"$f":"B463+1","v":32301},null,"PL",{"$f":"OFFSET(F464,-12,0)&\" \"&OFFSET(F464,-1,0)&\" \"&INDIRECT(OFFSET(F464,-12,0)&\"!A4\")","v":"Leer Entwicklung Projektleitung"},{"$f":"VLOOKUP(OFFSET(G464,-12,-1),Projektübersicht,5,0)","v":{"$error":"#N/A"}},{"$f":"VLOOKUP(OFFSET(H464,-12,-2),Projektübersicht,6,0)","v":{"$error":"#N/A"}},{"$f":"\"Aus Top Down \"&OFFSET(I464,-12,-3)","v":"Aus Top Down Leer"},{"$f":"IF(ISNA(H464),0,1)","v":{"v":0,"d":"0.000"}},{"$f":"INDIRECT(\"'\"&OFFSET(K464,-12,-5)&\"'!D4\")","v":{"v":0,"d":"0.0"}},{"v":0,"d":"0.0"},{"$nulls":3},{"$f":"IF(ISNA($H464),0,zeitausschnitt($G464,$H464,$L464,P$9,P$10))","v":0},{"$f":"IF(ISNA($H464),0,zeitausschnitt($G464,$H464,$L464,Q$9,Q$10))","v":0},0,0,0,0,0,0,0,0,0,0,0,0,0,0,0,0,0,0,0]
[32000,{"$f":"B464","v":32300},{"$f":"C464+1","v":32302},null,"Entwicklung",{"$f":"OFFSET(F465,-13,0)&\" \"&OFFSET(F465,-2,0)&\" \"&INDIRECT(OFFSET(F465,-13,0)&\"!A5\")","v":"Leer Entwicklung Entwicklung"},{"$f":"G464","v":{"$error":"#N/A"}},{"$f":"H464","v":{"$error":"#N/A"}},{"$f":"\"Aus Top Down \"&OFFSET(I465,-13,-3)","v":"Aus Top Down Leer"},{"$f":"IF(ISNA(H465),0,1)","v":{"v":0,"d":"0.000"}},{"$f":"INDIRECT(\"'\"&OFFSET(K465,-13,-5)&\"'!D5\")","v":{"v":0,"d":"0.0"}},{"v":0,"d":"0.0"},{"$nulls":3},{"$f":"IF(ISNA($H465),0,zeitausschnitt($G465,$H465,$L465,P$9,P$10))","v":0},0,0,0,0,0,0,0,0,0,0,0,0,0,0,0,0,0,0,0,0]
[32000,{"$f":"B465","v":32300},{"$f":"C465+1","v":32303},null,"Test",{"$f":"OFFSET(F466,-14,0)&\" \"&OFFSET(F466,-3,0)&\" \"&INDIRECT(OFFSET(F466,-14,0)&\"!A6\")","v":"Leer Entwicklung Test"},{"$f":"G465","v":{"$error":"#N/A"}},{"$f":"H465","v":{"$error":"#N/A"}},{"$f":"\"Aus Top Down \"&OFFSET(I466,-14,-3)","v":"Aus Top Down Leer"},{"$f":"IF(ISNA(H466),0,1)","v":{"v":0,"d":"0.000"}},{"$f":"INDIRECT(\"'\"&OFFSET(K466,-14,-5)&\"'!D6\")","v":{"v":0,"d":"0.0"}},{"v":0,"d":"0.0"},{"$nulls":3},0,0,0,0,0,0,0,0,0,0,0,0,0,0,0,0,0,0,0,0,0]
[32000,{"$nulls":10},""]
[32000,{"$f":"B463+100","v":32400},{"$nulls":3},{"$f":"INDIRECT(OFFSET(F468,-16,0)&\"!E1\")","v":"Pflege"},{"$f":"MIN(G469:G471)","v":{"$error":"#N/A"}},{"$f":"MAX(H469:H471)","v":{"$error":"#N/A"}},{"$nulls":3},"",{"$f":"SUMIF(B$12:B$519,B468,L$12:L$519)","v":{"v":0,"d":"0.0"}}]
[32000,{"$f":"B468","v":32400},{"$f":"B468+1","v":32401},null,"PL",{"$f":"OFFSET(F469,-17,0)&\" \"&OFFSET(F469,-1,0)&\" \"&INDIRECT(OFFSET(F469,-17,0)&\"!A4\")","v":"Leer Pflege Projektleitung"},{"$f":"VLOOKUP(OFFSET(G469,-17,-1),Projektübersicht,6,0)","v":{"$error":"#N/A"}},{"$f":"VLOOKUP(OFFSET(H469,-17,-2),Projektübersicht,7,0)","v":{"$error":"#N/A"}},{"$f":"\"Aus Top Down \"&OFFSET(I469,-17,-3)","v":"Aus Top Down Leer"},{"$f":"IF(ISNA(H469),0,1)","v":{"v":0,"d":"0.000"}},{"$f":"INDIRECT(\"'\"&OFFSET(K469,-17,-5)&\"'!E4\")","v":{"v":0,"d":"0.0"}},{"v":0,"d":"0.0"},{"$nulls":3},{"$f":"IF(ISNA($H469),0,zeitausschnitt($G469,$H469,$L469,P$9,P$10))","v":0},{"$f":"IF(ISNA($H469),0,zeitausschnitt($G469,$H469,$L469,Q$9,Q$10))","v":0},0,0,0,0,0,0,0,0,0,0,0,0,0,0,0,0,0,0,0]
[32000,{"$f":"B469","v":32400},{"$f":"C469+1","v":32402},null,"Entwicklung",{"$f":"OFFSET(F470,-18,0)&\" \"&OFFSET(F470,-2,0)&\" \"&INDIRECT(OFFSET(F470,-18,0)&\"!A5\")","v":"Leer Pflege Entwicklung"},{"$f":"G469","v":{"$error":"#N/A"}},{"$f":"H469","v":{"$error":"#N/A"}},{"$f":"\"Aus Top Down \"&OFFSET(I470,-18,-3)","v":"Aus Top Down Leer"},{"$f":"IF(ISNA(H470),0,1)","v":{"v":0,"d":"0.000"}},{"$f":"INDIRECT(\"'\"&OFFSET(K470,-18,-5)&\"'!E5\")","v":{"v":0,"d":"0.0"}},{"v":0,"d":"0.0"},{"$nulls":3},{"$f":"IF(ISNA($H470),0,zeitausschnitt($G470,$H470,$L470,P$9,P$10))","v":0},0,0,0,0,0,0,0,0,0,0,0,0,0,0,0,0,0,0,0,0]
[32000,{"$f":"B470","v":32400},{"$f":"C470+1","v":32403},null,"Test",{"$f":"OFFSET(F471,-19,0)&\" \"&OFFSET(F471,-3,0)&\" \"&INDIRECT(OFFSET(F471,-19,0)&\"!A6\")","v":"Leer Pflege Test"},{"$f":"G470","v":{"$error":"#N/A"}},{"$f":"H470","v":{"$error":"#N/A"}},{"$f":"\"Aus Top Down \"&OFFSET(I471,-19,-3)","v":"Aus Top Down Leer"},{"$f":"IF(ISNA(H471),0,1)","v":{"v":0,"d":"0.000"}},{"$f":"INDIRECT(\"'\"&OFFSET(K471,-19,-5)&\"'!E6\")","v":{"v":0,"d":"0.0"}},{"v":0,"d":"0.0"},{"$nulls":3},0,0,0,0,0,0,0,0,0,0,0,0,0,0,0,0,0,0,0,0,0]
[32000,{"$nulls":10},""]
[{"$nulls":11},{"$f":"IF(AND(J473<>\"\",K473<>\"\"),J473*K473,\"\")","v":""}]
[{"$f":"A452+1000","v":33000},{"$nulls":4},{"$f":"INDIRECT(CONCATENATE(\"Übersicht!C\",TEXT((A474-10000)/1000,0)))","v":"Leer"},{"$f":"MIN(G475:G489)","v":{"$error":"#N/A"}},{"$f":"MAX(H475:H489)","v":{"$error":"#N/A"}},{"$nulls":3},"",{"$f":"SUMIF(A$12:A$519,A474,L$12:L$519)","v":{"v":0,"d":"0.0"}},null,{"$f":"F474","v":"Leer"},{"$f":"SUM(P476:P493)","v":0},{"$f":"SUM(Q476:Q493)","v":0},0,0,0,0,0,0,0,0,0,0,0,0,0,0,0,0,0,0,0]
[{"$f":"A474","v":33000},{"$f":"A474+100","v":33100},{"$nulls":3},{"$f":"INDIRECT(OFFSET(F475,-1,0)&\"!B1\")","v":"Studie"},{"$f":"MIN(G476:G478)","v":"00:00:00"},{"$f":"MAX(H476:H478)","v":{"$error":"#N/A"}},{"$nulls":3},"",{"$f":"SUMIF(B$12:B$519,B475,L$12:L$519)","v":{"v":0,"d":"0.0"}}]
[{"$f":"A475","v":33000},{"$f":"B475","v":33100},{"$f":"B475+1","v":33101},null,"PL",{"$f":"OFFSET(F476,-2,0)&\" \"&OFFSET(F476,-1,0)&\" \"&INDIRECT(OFFSET(F476,-2,0)&\"!A4\")","v":"Leer Studie Projektleitung"},{"$f":"VLOOKUP(OFFSET(G476,-2,-1),Projektübersicht,3,0)","v":"00:00:00"},{"$f":"VLOOKUP(OFFSET(H476,-2,-2),Projektübersicht,4,0)","v":{"$error":"#N/A"}},{"$f":"\"Aus Top Down \"&OFFSET(I476,-2,-3)","v":"Aus Top Down Leer"},{"$f":"IF(ISNA(H476),0,1)","v":{"v":0,"d":"0.000"}},{"$f":"INDIRECT(\"'\"&OFFSET(K476,-2,-5)&\"'!B4\")","v":{"v":0,"d":"0.0"}},{"v":0,"d":"0.0"},{"$nulls":3},{"$f":"IF(ISNA($H476),0,zeitausschnitt($G476,$H476,$L476,P$9,P$10))","v":0},{"$f":"IF(ISNA($H476),0,zeitausschnitt($G476,$H476,$L476,Q$9,Q$10))","v":0},0,0,0,0,0,0,0,0,0,0,0,0,0,0,0,0,0,0,0]
[{"$f":"A476","v":33000},{"$f":"B476","v":33100},{"$f":"C476+1","v":33102},null,"Entwicklung",{"$f":"OFFSET(F477,-3,0)&\" \"&OFFSET(F477,-2,0)&\" \"&INDIRECT(OFFSET(F477,-3,0)&\"!A5\")","v":"Leer Studie Entwicklung"},{"$f":"G476","v":"00:00:00"},{"$f":"H476","v":{"$error":"#N/A"}},{"$f":"\"Aus Top Down \"&OFFSET(I477,-3,-3)","v":"Aus Top Down Leer"},{"$f":"IF(ISNA(H477),0,1)","v":{"v":0,"d":"0.000"}},{"$f":"INDIRECT(\"'\"&OFFSET(K477,-3,-5)&\"'!B5\")","v":{"v":0,"d":"0.0"}},{"v":0,"d":"0.0"},{"$nulls":3},{"$f":"IF(ISNA($H477),0,zeitausschnitt($G477,$H477,$L477,P$9,P$10))","v":0},0,0,0,0,0,0,0,0,0,0,0,0,0,0,0,0,0,0,0,0]
[33000,{"$f":"B477","v":33100},{"$f":"C477+1","v":33103},null,"Test",{"$f":"OFFSET(F478,-4,0)&\" \"&OFFSET(F478,-3,0)&\" \"&INDIRECT(OFFSET(F478,-4,0)&\"!A6\")","v":"Leer Studie Test"},{"$f":"G477","v":"00:00:00"},{"$f":"H477","v":{"$error":"#N/A"}},{"$f":"\"Aus Top Down \"&OFFSET(I478,-4,-3)","v":"Aus Top Down Leer"},{"$f":"IF(ISNA(H478),0,1)","v":{"v":0,"d":"0.000"}},{"$f":"INDIRECT(\"'\"&OFFSET(K478,-4,-5)&\"'!B6\")","v":{"v":0,"d":"0.0"}},{"v":0,"d":"0.0"},{"$nulls":3},0,0,0,0,0,0,0,0,0,0,0,0,0,0,0,0,0,0,0,0,0]
[33000,{"$nulls":10},""]
[33000,{"$f":"B475+100","v":33200},{"$nulls":3},{"$f":"INDIRECT(OFFSET(F480,-6,0)&\"!C1\")","v":"Konzept "},{"$f":"MIN(G481:G483)","v":{"$error":"#N/A"}},{"$f":"MAX(H481:H483)","v":{"$error":"#N/A"}},{"$nulls":3},"",{"$f":"SUMIF(B$12:B$519,B480,L$12:L$519)","v":{"v":0,"d":"0.0"}}]
[33000,{"$f":"B480","v":33200},{"$f":"B480+1","v":33201},null,"PL",{"$f":"OFFSET(F481,-7,0)&\" \"&OFFSET(F481,-1,0)&\" \"&INDIRECT(OFFSET(F481,-7,0)&\"!A4\")","v":"Leer Konzept  Projektleitung"},{"$f":"VLOOKUP(OFFSET(G481,-7,-1),Projektübersicht,4,0)","v":{"$error":"#N/A"}},{"$f":"VLOOKUP(OFFSET(H481,-7,-2),Projektübersicht,5,0)","v":{"$error":"#N/A"}},{"$f":"\"Aus Top Down \"&OFFSET(I481,-7,-3)","v":"Aus Top Down Leer"},{"$f":"IF(ISNA(H481),0,1)","v":{"v":0,"d":"0.000"}},{"$f":"INDIRECT(\"'\"&OFFSET(K481,-7,-5)&\"'!C4\")","v":{"v":0,"d":"0.0"}},{"v":0,"d":"0.0"},{"$nulls":3},{"$f":"IF(ISNA($H481),0,zeitausschnitt($G481,$H481,$L481,P$9,P$10))","v":0},{"$f":"IF(ISNA($H481),0,zeitausschnitt($G481,$H481,$L481,Q$9,Q$10))","v":0},0,0,0,0,0,0,0,0,0,0,0,0,0,0,0,0,0,0,0]
[33000,{"$f":"B481","v":33200},{"$f":"C481+1","v":33202},null,"Entwicklung",{"$f":"OFFSET(F482,-8,0)&\" \"&OFFSET(F482,-2,0)&\" \"&INDIRECT(OFFSET(F482,-8,0)&\"!A5\")","v":"Leer Konzept  Entwicklung"},{"$f":"G481","v":{"$error":"#N/A"}},{"$f":"H481","v":{"$error":"#N/A"}},{"$f":"\"Aus Top Down \"&OFFSET(I482,-8,-3)","v":"Aus Top Down Leer"},{"$f":"IF(ISNA(H482),0,1)","v":{"v":0,"d":"0.000"}},{"$f":"INDIRECT(\"'\"&OFFSET(K482,-8,-5)&\"'!C5\")","v":{"v":0,"d":"0.0"}},{"v":0,"d":"0.0"},{"$nulls":3},{"$f":"IF(ISNA($H482),0,zeitausschnitt($G482,$H482,$L482,P$9,P$10))","v":0},0,0,0,0,0,0,0,0,0,0,0,0,0,0,0,0,0,0,0,0]
[33000,{"$f":"B482","v":33200},{"$f":"C482+1","v":33203},null,"Test",{"$f":"OFFSET(F483,-9,0)&\" \"&OFFSET(F483,-3,0)&\" \"&INDIRECT(OFFSET(F483,-9,0)&\"!A6\")","v":"Leer Konzept  Test"},{"$f":"G482","v":{"$error":"#N/A"}},{"$f":"H482","v":{"$error":"#N/A"}},{"$f":"\"Aus Top Down \"&OFFSET(I483,-9,-3)","v":"Aus Top Down Leer"},{"$f":"IF(ISNA(H483),0,1)","v":{"v":0,"d":"0.000"}},{"$f":"INDIRECT(\"'\"&OFFSET(K483,-9,-5)&\"'!C6\")","v":{"v":0,"d":"0.0"}},{"v":0,"d":"0.0"},{"$nulls":3},0,0,0,0,0,0,0,0,0,0,0,0,0,0,0,0,0,0,0,0,0]
[33000,{"$nulls":10},""]
[33000,{"$f":"B480+100","v":33300},{"$nulls":3},{"$f":"INDIRECT(OFFSET(F485,-11,0)&\"!D1\")","v":"Entwicklung"},{"$f":"MIN(G486:G488)","v":{"$error":"#N/A"}},{"$f":"MAX(H486:H488)","v":{"$error":"#N/A"}},{"$nulls":3},"",{"$f":"SUMIF(B$12:B$519,B485,L$12:L$519)","v":{"v":0,"d":"0.0"}}]
[33000,{"$f":"B485","v":33300},{"$f":"B485+1","v":33301},null,"PL",{"$f":"OFFSET(F486,-12,0)&\" \"&OFFSET(F486,-1,0)&\" \"&INDIRECT(OFFSET(F486,-12,0)&\"!A4\")","v":"Leer Entwicklung Projektleitung"},{"$f":"VLOOKUP(OFFSET(G486,-12,-1),Projektübersicht,5,0)","v":{"$error":"#N/A"}},{"$f":"VLOOKUP(OFFSET(H486,-12,-2),Projektübersicht,6,0)","v":{"$error":"#N/A"}},{"$f":"\"Aus Top Down \"&OFFSET(I486,-12,-3)","v":"Aus Top Down Leer"},{"$f":"IF(ISNA(H486),0,1)","v":{"v":0,"d":"0.000"}},{"$f":"INDIRECT(\"'\"&OFFSET(K486,-12,-5)&\"'!D4\")","v":{"v":0,"d":"0.0"}},{"v":0,"d":"0.0"},{"$nulls":3},{"$f":"IF(ISNA($H486),0,zeitausschnitt($G486,$H486,$L486,P$9,P$10))","v":0},{"$f":"IF(ISNA($H486),0,zeitausschnitt($G486,$H486,$L486,Q$9,Q$10))","v":0},0,0,0,0,0,0,0,0,0,0,0,0,0,0,0,0,0,0,0]
[33000,{"$f":"B486","v":33300},{"$f":"C486+1","v":33302},null,"Entwicklung",{"$f":"OFFSET(F487,-13,0)&\" \"&OFFSET(F487,-2,0)&\" \"&INDIRECT(OFFSET(F487,-13,0)&\"!A5\")","v":"Leer Entwicklung Entwicklung"},{"$f":"G486","v":{"$error":"#N/A"}},{"$f":"H486","v":{"$error":"#N/A"}},{"$f":"\"Aus Top Down \"&OFFSET(I487,-13,-3)","v":"Aus Top Down Leer"},{"$f":"IF(ISNA(H487),0,1)","v":{"v":0,"d":"0.000"}},{"$f":"INDIRECT(\"'\"&OFFSET(K487,-13,-5)&\"'!D5\")","v":{"v":0,"d":"0.0"}},{"v":0,"d":"0.0"},{"$nulls":3},{"$f":"IF(ISNA($H487),0,zeitausschnitt($G487,$H487,$L487,P$9,P$10))","v":0},0,0,0,0,0,0,0,0,0,0,0,0,0,0,0,0,0,0,0,0]
[33000,{"$f":"B487","v":33300},{"$f":"C487+1","v":33303},null,"Test",{"$f":"OFFSET(F488,-14,0)&\" \"&OFFSET(F488,-3,0)&\" \"&INDIRECT(OFFSET(F488,-14,0)&\"!A6\")","v":"Leer Entwicklung Test"},{"$f":"G487","v":{"$error":"#N/A"}},{"$f":"H487","v":{"$error":"#N/A"}},{"$f":"\"Aus Top Down \"&OFFSET(I488,-14,-3)","v":"Aus Top Down Leer"},{"$f":"IF(ISNA(H488),0,1)","v":{"v":0,"d":"0.000"}},{"$f":"INDIRECT(\"'\"&OFFSET(K488,-14,-5)&\"'!D6\")","v":{"v":0,"d":"0.0"}},{"v":0,"d":"0.0"},{"$nulls":3},0,0,0,0,0,0,0,0,0,0,0,0,0,0,0,0,0,0,0,0,0]
[33000,{"$nulls":10},""]
[33000,{"$f":"B485+100","v":33400},{"$nulls":3},{"$f":"INDIRECT(OFFSET(F490,-16,0)&\"!E1\")","v":"Pflege"},{"$f":"MIN(G491:G493)","v":{"$error":"#N/A"}},{"$f":"MAX(H491:H493)","v":{"$error":"#N/A"}},{"$nulls":3},"",{"$f":"SUMIF(B$12:B$519,B490,L$12:L$519)","v":{"v":0,"d":"0.0"}}]
[33000,{"$f":"B490","v":33400},{"$f":"B490+1","v":33401},null,"PL",{"$f":"OFFSET(F491,-17,0)&\" \"&OFFSET(F491,-1,0)&\" \"&INDIRECT(OFFSET(F491,-17,0)&\"!A4\")","v":"Leer Pflege Projektleitung"},{"$f":"VLOOKUP(OFFSET(G491,-17,-1),Projektübersicht,6,0)","v":{"$error":"#N/A"}},{"$f":"VLOOKUP(OFFSET(H491,-17,-2),Projektübersicht,7,0)","v":{"$error":"#N/A"}},{"$f":"\"Aus Top Down \"&OFFSET(I491,-17,-3)","v":"Aus Top Down Leer"},{"$f":"IF(ISNA(H491),0,1)","v":{"v":0,"d":"0.000"}},{"$f":"INDIRECT(\"'\"&OFFSET(K491,-17,-5)&\"'!E4\")","v":{"v":0,"d":"0.0"}},{"v":0,"d":"0.0"},{"$nulls":3},{"$f":"IF(ISNA($H491),0,zeitausschnitt($G491,$H491,$L491,P$9,P$10))","v":0},{"$f":"IF(ISNA($H491),0,zeitausschnitt($G491,$H491,$L491,Q$9,Q$10))","v":0},0,0,0,0,0,0,0,0,0,0,0,0,0,0,0,0,0,0,0]
[33000,{"$f":"B491","v":33400},{"$f":"C491+1","v":33402},null,"Entwicklung",{"$f":"OFFSET(F492,-18,0)&\" \"&OFFSET(F492,-2,0)&\" \"&INDIRECT(OFFSET(F492,-18,0)&\"!A5\")","v":"Leer Pflege Entwicklung"},{"$f":"G491","v":{"$error":"#N/A"}},{"$f":"H491","v":{"$error":"#N/A"}},{"$f":"\"Aus Top Down \"&OFFSET(I492,-18,-3)","v":"Aus Top Down Leer"},{"$f":"IF(ISNA(H492),0,1)","v":{"v":0,"d":"0.000"}},{"$f":"INDIRECT(\"'\"&OFFSET(K492,-18,-5)&\"'!E5\")","v":{"v":0,"d":"0.0"}},{"v":0,"d":"0.0"},{"$nulls":3},{"$f":"IF(ISNA($H492),0,zeitausschnitt($G492,$H492,$L492,P$9,P$10))","v":0},0,0,0,0,0,0,0,0,0,0,0,0,0,0,0,0,0,0,0,0]
[33000,{"$f":"B492","v":33400},{"$f":"C492+1","v":33403},null,"Test",{"$f":"OFFSET(F493,-19,0)&\" \"&OFFSET(F493,-3,0)&\" \"&INDIRECT(OFFSET(F493,-19,0)&\"!A6\")","v":"Leer Pflege Test"},{"$f":"G492","v":{"$error":"#N/A"}},{"$f":"H492","v":{"$error":"#N/A"}},{"$f":"\"Aus Top Down \"&OFFSET(I493,-19,-3)","v":"Aus Top Down Leer"},{"$f":"IF(ISNA(H493),0,1)","v":{"v":0,"d":"0.000"}},{"$f":"INDIRECT(\"'\"&OFFSET(K493,-19,-5)&\"'!E6\")","v":{"v":0,"d":"0.0"}},{"v":0,"d":"0.0"},{"$nulls":3},0,0,0,0,0,0,0,0,0,0,0,0,0,0,0,0,0,0,0,0,0]
[33000,{"$nulls":10},""]
[{"$nulls":11},{"$f":"IF(AND(J495<>\"\",K495<>\"\"),J495*K495,\"\")","v":""}]
[{"$f":"A474+1000","v":34000},{"$nulls":4},{"$f":"INDIRECT(CONCATENATE(\"Übersicht!C\",TEXT((A496-10000)/1000,0)))","v":"Leer"},{"$f":"MIN(G497:G511)","v":{"$error":"#N/A"}},{"$f":"MAX(H497:H511)","v":{"$error":"#N/A"}},{"$nulls":3},"",{"$f":"SUMIF(A$12:A$519,A496,L$12:L$519)","v":{"v":0,"d":"0.0"}},null,{"$f":"F496","v":"Leer"},{"$f":"SUM(P498:P515)","v":0},{"$f":"SUM(Q498:Q515)","v":0},0,0,0,0,0,0,0,0,0,0,0,0,0,0,0,0,0,0,0]
[{"$f":"A496","v":34000},{"$f":"A496+100","v":34100},{"$nulls":3},{"$f":"INDIRECT(OFFSET(F497,-1,0)&\"!B1\")","v":"Studie"},{"$f":"MIN(G498:G500)","v":"00:00:00"},{"$f":"MAX(H498:H500)","v":{"$error":"#N/A"}},{"$nulls":3},"",{"$f":"SUMIF(B$12:B$519,B497,L$12:L$519)","v":{"v":0,"d":"0.0"}}]
[{"$f":"A497","v":34000},{"$f":"B497","v":34100},{"$f":"B497+1","v":34101},null,"PL",{"$f":"OFFSET(F498,-2,0)&\" \"&OFFSET(F498,-1,0)&\" \"&INDIRECT(OFFSET(F498,-2,0)&\"!A4\")","v":"Leer Studie Projektleitung"},{"$f":"VLOOKUP(OFFSET(G498,-2,-1),Projektübersicht,3,0)","v":"00:00:00"},{"$f":"VLOOKUP(OFFSET(H498,-2,-2),Projektübersicht,4,0)","v":{"$error":"#N/A"}},{"$f":"\"Aus Top Down \"&OFFSET(I498,-2,-3)","v":"Aus Top Down Leer"},{"$f":"IF(ISNA(H498),0,1)","v":{"v":0,"d":"0.000"}},{"$f":"INDIRECT(\"'\"&OFFSET(K498,-2,-5)&\"'!B4\")","v":{"v":0,"d":"0.0"}},{"v":0,"d":"0.0"},{"$nulls":3},{"$f":"IF(ISNA($H498),0,zeitausschnitt($G498,$H498,$L498,P$9,P$10))","v":0},{"$f":"IF(ISNA($H498),0,zeitausschnitt($G498,$H498,$L498,Q$9,Q$10))","v":0},0,0,0,0,0,0,0,0,0,0,0,0,0,0,0,0,0,0,0]
[{"$f":"A498","v":34000},{"$f":"B498","v":34100},{"$f":"C498+1","v":34102},null,"Entwicklung",{"$f":"OFFSET(F499,-3,0)&\" \"&OFFSET(F499,-2,0)&\" \"&INDIRECT(OFFSET(F499,-3,0)&\"!A5\")","v":"Leer Studie Entwicklung"},{"$f":"G498","v":"00:00:00"},{"$f":"H498","v":{"$error":"#N/A"}},{"$f":"\"Aus Top Down \"&OFFSET(I499,-3,-3)","v":"Aus Top Down Leer"},{"$f":"IF(ISNA(H499),0,1)","v":{"v":0,"d":"0.000"}},{"$f":"INDIRECT(\"'\"&OFFSET(K499,-3,-5)&\"'!B5\")","v":{"v":0,"d":"0.0"}},{"v":0,"d":"0.0"},{"$nulls":3},{"$f":"IF(ISNA($H499),0,zeitausschnitt($G499,$H499,$L499,P$9,P$10))","v":0},0,0,0,0,0,0,0,0,0,0,0,0,0,0,0,0,0,0,0,0]
[34000,{"$f":"B499","v":34100},{"$f":"C499+1","v":34103},null,"Test",{"$f":"OFFSET(F500,-4,0)&\" \"&OFFSET(F500,-3,0)&\" \"&INDIRECT(OFFSET(F500,-4,0)&\"!A6\")","v":"Leer Studie Test"},{"$f":"G499","v":"00:00:00"},{"$f":"H499","v":{"$error":"#N/A"}},{"$f":"\"Aus Top Down \"&OFFSET(I500,-4,-3)","v":"Aus Top Down Leer"},{"$f":"IF(ISNA(H500),0,1)","v":{"v":0,"d":"0.000"}},{"$f":"INDIRECT(\"'\"&OFFSET(K500,-4,-5)&\"'!B6\")","v":{"v":0,"d":"0.0"}},{"v":0,"d":"0.0"},{"$nulls":3},0,0,0,0,0,0,0,0,0,0,0,0,0,0,0,0,0,0,0,0,0]
[34000,{"$nulls":10},""]
[34000,{"$f":"B497+100","v":34200},{"$nulls":3},{"$f":"INDIRECT(OFFSET(F502,-6,0)&\"!C1\")","v":"Konzept "},{"$f":"MIN(G503:G505)","v":{"$error":"#N/A"}},{"$f":"MAX(H503:H505)","v":{"$error":"#N/A"}},{"$nulls":3},"",{"$f":"SUMIF(B$12:B$519,B502,L$12:L$519)","v":{"v":0,"d":"0.0"}}]
[34000,{"$f":"B502","v":34200},{"$f":"B502+1","v":34201},null,"PL",{"$f":"OFFSET(F503,-7,0)&\" \"&OFFSET(F503,-1,0)&\" \"&INDIRECT(OFFSET(F503,-7,0)&\"!A4\")","v":"Leer Konzept  Projektleitung"},{"$f":"VLOOKUP(OFFSET(G503,-7,-1),Projektübersicht,4,0)","v":{"$error":"#N/A"}},{"$f":"VLOOKUP(OFFSET(H503,-7,-2),Projektübersicht,5,0)","v":{"$error":"#N/A"}},{"$f":"\"Aus Top Down \"&OFFSET(I503,-7,-3)","v":"Aus Top Down Leer"},{"$f":"IF(ISNA(H503),0,1)","v":{"v":0,"d":"0.000"}},{"$f":"INDIRECT(\"'\"&OFFSET(K503,-7,-5)&\"'!C4\")","v":{"v":0,"d":"0.0"}},{"v":0,"d":"0.0"},{"$nulls":3},{"$f":"IF(ISNA($H503),0,zeitausschnitt($G503,$H503,$L503,P$9,P$10))","v":0},{"$f":"IF(ISNA($H503),0,zeitausschnitt($G503,$H503,$L503,Q$9,Q$10))","v":0},0,0,0,0,0,0,0,0,0,0,0,0,0,0,0,0,0,0,0]
[34000,{"$f":"B503","v":34200},{"$f":"C503+1","v":34202},null,"Entwicklung",{"$f":"OFFSET(F504,-8,0)&\" \"&OFFSET(F504,-2,0)&\" \"&INDIRECT(OFFSET(F504,-8,0)&\"!A5\")","v":"Leer Konzept  Entwicklung"},{"$f":"G503","v":{"$error":"#N/A"}},{"$f":"H503","v":{"$error":"#N/A"}},{"$f":"\"Aus Top Down \"&OFFSET(I504,-8,-3)","v":"Aus Top Down Leer"},{"$f":"IF(ISNA(H504),0,1)","v":{"v":0,"d":"0.000"}},{"$f":"INDIRECT(\"'\"&OFFSET(K504,-8,-5)&\"'!C5\")","v":{"v":0,"d":"0.0"}},{"v":0,"d":"0.0"},{"$nulls":3},{"$f":"IF(ISNA($H504),0,zeitausschnitt($G504,$H504,$L504,P$9,P$10))","v":0},0,0,0,0,0,0,0,0,0,0,0,0,0,0,0,0,0,0,0,0]
[34000,{"$f":"B504","v":34200},{"$f":"C504+1","v":34203},null,"Test",{"$f":"OFFSET(F505,-9,0)&\" \"&OFFSET(F505,-3,0)&\" \"&INDIRECT(OFFSET(F505,-9,0)&\"!A6\")","v":"Leer Konzept  Test"},{"$f":"G504","v":{"$error":"#N/A"}},{"$f":"H504","v":{"$error":"#N/A"}},{"$f":"\"Aus Top Down \"&OFFSET(I505,-9,-3)","v":"Aus Top Down Leer"},{"$f":"IF(ISNA(H505),0,1)","v":{"v":0,"d":"0.000"}},{"$f":"INDIRECT(\"'\"&OFFSET(K505,-9,-5)&\"'!C6\")","v":{"v":0,"d":"0.0"}},{"v":0,"d":"0.0"},{"$nulls":3},0,0,0,0,0,0,0,0,0,0,0,0,0,0,0,0,0,0,0,0,0]
[34000,{"$nulls":10},""]
[34000,{"$f":"B502+100","v":34300},{"$nulls":3},{"$f":"INDIRECT(OFFSET(F507,-11,0)&\"!D1\")","v":"Entwicklung"},{"$f":"MIN(G508:G510)","v":{"$error":"#N/A"}},{"$f":"MAX(H508:H510)","v":{"$error":"#N/A"}},{"$nulls":3},"",{"$f":"SUMIF(B$12:B$519,B507,L$12:L$519)","v":{"v":0,"d":"0.0"}}]
[34000,{"$f":"B507","v":34300},{"$f":"B507+1","v":34301},null,"PL",{"$f":"OFFSET(F508,-12,0)&\" \"&OFFSET(F508,-1,0)&\" \"&INDIRECT(OFFSET(F508,-12,0)&\"!A4\")","v":"Leer Entwicklung Projektleitung"},{"$f":"VLOOKUP(OFFSET(G508,-12,-1),Projektübersicht,5,0)","v":{"$error":"#N/A"}},{"$f":"VLOOKUP(OFFSET(H508,-12,-2),Projektübersicht,6,0)","v":{"$error":"#N/A"}},{"$f":"\"Aus Top Down \"&OFFSET(I508,-12,-3)","v":"Aus Top Down Leer"},{"$f":"IF(ISNA(H508),0,1)","v":{"v":0,"d":"0.000"}},{"$f":"INDIRECT(\"'\"&OFFSET(K508,-12,-5)&\"'!D4\")","v":{"v":0,"d":"0.0"}},{"v":0,"d":"0.0"},{"$nulls":3},{"$f":"IF(ISNA($H508),0,zeitausschnitt($G508,$H508,$L508,P$9,P$10))","v":0},{"$f":"IF(ISNA($H508),0,zeitausschnitt($G508,$H508,$L508,Q$9,Q$10))","v":0},0,0,0,0,0,0,0,0,0,0,0,0,0,0,0,0,0,0,0]
[34000,{"$f":"B508","v":34300},{"$f":"C508+1","v":34302},null,"Entwicklung",{"$f":"OFFSET(F509,-13,0)&\" \"&OFFSET(F509,-2,0)&\" \"&INDIRECT(OFFSET(F509,-13,0)&\"!A5\")","v":"Leer Entwicklung Entwicklung"},{"$f":"G508","v":{"$error":"#N/A"}},{"$f":"H508","v":{"$error":"#N/A"}},{"$f":"\"Aus Top Down \"&OFFSET(I509,-13,-3)","v":"Aus Top Down Leer"},{"$f":"IF(ISNA(H509),0,1)","v":{"v":0,"d":"0.000"}},{"$f":"INDIRECT(\"'\"&OFFSET(K509,-13,-5)&\"'!D5\")","v":{"v":0,"d":"0.0"}},{"v":0,"d":"0.0"},{"$nulls":3},{"$f":"IF(ISNA($H509),0,zeitausschnitt($G509,$H509,$L509,P$9,P$10))","v":0},0,0,0,0,0,0,0,0,0,0,0,0,0,0,0,0,0,0,0,0]
[34000,{"$f":"B509","v":34300},{"$f":"C509+1","v":34303},null,"Test",{"$f":"OFFSET(F510,-14,0)&\" \"&OFFSET(F510,-3,0)&\" \"&INDIRECT(OFFSET(F510,-14,0)&\"!A6\")","v":"Leer Entwicklung Test"},{"$f":"G509","v":{"$error":"#N/A"}},{"$f":"H509","v":{"$error":"#N/A"}},{"$f":"\"Aus Top Down \"&OFFSET(I510,-14,-3)","v":"Aus Top Down Leer"},{"$f":"IF(ISNA(H510),0,1)","v":{"v":0,"d":"0.000"}},{"$f":"INDIRECT(\"'\"&OFFSET(K510,-14,-5)&\"'!D6\")","v":{"v":0,"d":"0.0"}},{"v":0,"d":"0.0"},{"$nulls":3},0,0,0,0,0,0,0,0,0,0,0,0,0,0,0,0,0,0,0,0,0]
[34000,{"$nulls":10},""]
[34000,{"$f":"B507+100","v":34400},{"$nulls":3},{"$f":"INDIRECT(OFFSET(F512,-16,0)&\"!E1\")","v":"Pflege"},{"$f":"MIN(G513:G515)","v":{"$error":"#N/A"}},{"$f":"MAX(H513:H515)","v":{"$error":"#N/A"}},{"$nulls":3},"",{"$f":"SUMIF(B$12:B$519,B512,L$12:L$519)","v":{"v":0,"d":"0.0"}}]
[34000,{"$f":"B512","v":34400},{"$f":"B512+1","v":34401},null,"PL",{"$f":"OFFSET(F513,-17,0)&\" \"&OFFSET(F513,-1,0)&\" \"&INDIRECT(OFFSET(F513,-17,0)&\"!A4\")","v":"Leer Pflege Projektleitung"},{"$f":"VLOOKUP(OFFSET(G513,-17,-1),Projektübersicht,6,0)","v":{"$error":"#N/A"}},{"$f":"VLOOKUP(OFFSET(H513,-17,-2),Projektübersicht,7,0)","v":{"$error":"#N/A"}},{"$f":"\"Aus Top Down \"&OFFSET(I513,-17,-3)","v":"Aus Top Down Leer"},{"$f":"IF(ISNA(H513),0,1)","v":{"v":0,"d":"0.000"}},{"$f":"INDIRECT(\"'\"&OFFSET(K513,-17,-5)&\"'!E4\")","v":{"v":0,"d":"0.0"}},{"v":0,"d":"0.0"},{"$nulls":3},{"$f":"IF(ISNA($H513),0,zeitausschnitt($G513,$H513,$L513,P$9,P$10))","v":0},{"$f":"IF(ISNA($H513),0,zeitausschnitt($G513,$H513,$L513,Q$9,Q$10))","v":0},0,0,0,0,0,0,0,0,0,0,0,0,0,0,0,0,0,0,0]
[34000,{"$f":"B513","v":34400},{"$f":"C513+1","v":34402},null,"Entwicklung",{"$f":"OFFSET(F514,-18,0)&\" \"&OFFSET(F514,-2,0)&\" \"&INDIRECT(OFFSET(F514,-18,0)&\"!A5\")","v":"Leer Pflege Entwicklung"},{"$f":"G513","v":{"$error":"#N/A"}},{"$f":"H513","v":{"$error":"#N/A"}},{"$f":"\"Aus Top Down \"&OFFSET(I514,-18,-3)","v":"Aus Top Down Leer"},{"$f":"IF(ISNA(H514),0,1)","v":{"v":0,"d":"0.000"}},{"$f":"INDIRECT(\"'\"&OFFSET(K514,-18,-5)&\"'!E5\")","v":{"v":0,"d":"0.0"}},{"v":0,"d":"0.0"},{"$nulls":3},{"$f":"IF(ISNA($H514),0,zeitausschnitt($G514,$H514,$L514,P$9,P$10))","v":0},0,0,0,0,0,0,0,0,0,0,0,0,0,0,0,0,0,0,0,0]
[34000,{"$f":"B514","v":34400},{"$f":"C514+1","v":34403},null,"Test",{"$f":"OFFSET(F515,-19,0)&\" \"&OFFSET(F515,-3,0)&\" \"&INDIRECT(OFFSET(F515,-19,0)&\"!A6\")","v":"Leer Pflege Test"},{"$f":"G514","v":{"$error":"#N/A"}},{"$f":"H514","v":{"$error":"#N/A"}},{"$f":"\"Aus Top Down \"&OFFSET(I515,-19,-3)","v":"Aus Top Down Leer"},{"$f":"IF(ISNA(H515),0,1)","v":{"v":0,"d":"0.000"}},{"$f":"INDIRECT(\"'\"&OFFSET(K515,-19,-5)&\"'!E6\")","v":{"v":0,"d":"0.0"}},{"v":0,"d":"0.0"},{"$nulls":3},0,0,0,0,0,0,0,0,0,0,0,0,0,0,0,0,0,0,0,0,0]
[34000,{"$nulls":10},""]
[{"$nulls":11},{"$f":"IF(AND(J517<>\"\",K517<>\"\"),J517*K517,\"\")","v":""}]
[{"$f":"A496+1000","v":35000},{"$nulls":4},{"$f":"INDIRECT(CONCATENATE(\"Übersicht!C\",TEXT((A518-10000)/1000,0)))","v":"Leer"},{"$f":"MIN(G519:G533)","v":{"$error":"#N/A"}},{"$f":"MAX(H519:H533)","v":{"$error":"#N/A"}},{"$nulls":3},{"$f":"IF(AND(J518<>\"\",K518<>\"\"),J518*K518,\"\")","v":""},{"$f":"SUMIF(A$12:A$519,A518,L$12:L$519)","v":{"v":0,"d":"0.0"}},null,{"$f":"F518","v":"Leer"},{"$f":"SUM(P520:P537)","v":0},{"$f":"SUM(Q520:Q537)","v":0},0,0,0,0,0,0,0,0,0,0,0,0,0,0,0,0,0,0,0]
[{"$f":"A518","v":35000},{"$f":"A518+100","v":35100},{"$nulls":3},{"$f":"INDIRECT(OFFSET(F519,-1,0)&\"!B1\")","v":"Studie"},{"$f":"MIN(G520:G522)","v":"00:00:00"},{"$f":"MAX(H520:H522)","v":{"$error":"#N/A"}},{"$nulls":3},"",{"$f":"SUMIF(B$12:B$519,B519,L$12:L$519)","v":{"v":0,"d":"0.0"}}]
[{"$f":"A519","v":35000},{"$f":"B519","v":35100},{"$f":"B519+1","v":35101},null,"PL",{"$f":"OFFSET(F520,-2,0)&\" \"&OFFSET(F520,-1,0)&\" \"&INDIRECT(OFFSET(F520,-2,0)&\"!A4\")","v":"Leer Studie Projektleitung"},{"$f":"VLOOKUP(OFFSET(G520,-2,-1),Projektübersicht,3,0)","v":"00:00:00"},{"$f":"VLOOKUP(OFFSET(H520,-2,-2),Projektübersicht,4,0)","v":{"$error":"#N/A"}},{"$f":"\"Aus Top Down \"&OFFSET(I520,-2,-3)","v":"Aus Top Down Leer"},{"$f":"IF(ISNA(H520),0,1)","v":{"v":0,"d":"0.000"}},{"$f":"INDIRECT(\"'\"&OFFSET(K520,-2,-5)&\"'!B4\")","v":{"v":0,"d":"0.0"}},{"v":0,"d":"0.0"},{"$nulls":3},{"$f":"IF(ISNA($H520),0,zeitausschnitt($G520,$H520,$L520,P$9,P$10))","v":0},{"$f":"IF(ISNA($H520),0,zeitausschnitt($G520,$H520,$L520,Q$9,Q$10))","v":0},0,0,0,0,0,0,0,0,0,0,0,0,0,0,0,0,0,0,0]
[{"$f":"A520","v":35000},{"$f":"B520","v":35100},{"$f":"C520+1","v":35102},null,"Entwicklung",{"$f":"OFFSET(F521,-3,0)&\" \"&OFFSET(F521,-2,0)&\" \"&INDIRECT(OFFSET(F521,-3,0)&\"!A5\")","v":"Leer Studie Entwicklung"},{"$f":"G520","v":"00:00:00"},{"$f":"H520","v":{"$error":"#N/A"}},{"$f":"\"Aus Top Down \"&OFFSET(I521,-3,-3)","v":"Aus Top Down Leer"},{"$f":"IF(ISNA(H521),0,1)","v":{"v":0,"d":"0.000"}},{"$f":"INDIRECT(\"'\"&OFFSET(K521,-3,-5)&\"'!B5\")","v":{"v":0,"d":"0.0"}},{"v":0,"d":"0.0"},{"$nulls":3},{"$f":"IF(ISNA($H521),0,zeitausschnitt($G521,$H521,$L521,P$9,P$10))","v":0},0,0,0,0,0,0,0,0,0,0,0,0,0,0,0,0,0,0,0,0]
[35000,{"$f":"B521","v":35100},{"$f":"C521+1","v":35103},null,"Test",{"$f":"OFFSET(F522,-4,0)&\" \"&OFFSET(F522,-3,0)&\" \"&INDIRECT(OFFSET(F522,-4,0)&\"!A6\")","v":"Leer Studie Test"},{"$f":"G521","v":"00:00:00"},{"$f":"H521","v":{"$error":"#N/A"}},{"$f":"\"Aus Top Down \"&OFFSET(I522,-4,-3)","v":"Aus Top Down Leer"},{"$f":"IF(ISNA(H522),0,1)","v":{"v":0,"d":"0.000"}},{"$f":"INDIRECT(\"'\"&OFFSET(K522,-4,-5)&\"'!B6\")","v":{"v":0,"d":"0.0"}},{"v":0,"d":"0.0"},{"$nulls":3},0,0,0,0,0,0,0,0,0,0,0,0,0,0,0,0,0,0,0,0,0]
[35000,{"$nulls":10},""]
[35000,{"$f":"B519+100","v":35200},{"$nulls":3},{"$f":"INDIRECT(OFFSET(F524,-6,0)&\"!C1\")","v":"Konzept "},{"$f":"MIN(G525:G527)","v":{"$error":"#N/A"}},{"$f":"MAX(H525:H527)","v":{"$error":"#N/A"}},{"$nulls":3},"",{"$f":"SUMIF(B$12:B$519,B524,L$12:L$519)","v":{"v":0,"d":"0.0"}}]
[35000,{"$f":"B524","v":35200},{"$f":"B524+1","v":35201},null,"PL",{"$f":"OFFSET(F525,-7,0)&\" \"&OFFSET(F525,-1,0)&\" \"&INDIRECT(OFFSET(F525,-7,0)&\"!A4\")","v":"Leer Konzept  Projektleitung"},{"$f":"VLOOKUP(OFFSET(G525,-7,-1),Projektübersicht,4,0)","v":{"$error":"#N/A"}},{"$f":"VLOOKUP(OFFSET(H525,-7,-2),Projektübersicht,5,0)","v":{"$error":"#N/A"}},{"$f":"\"Aus Top Down \"&OFFSET(I525,-7,-3)","v":"Aus Top Down Leer"},{"$f":"IF(ISNA(H525),0,1)","v":{"v":0,"d":"0.000"}},{"$f":"INDIRECT(\"'\"&OFFSET(K525,-7,-5)&\"'!C4\")","v":{"v":0,"d":"0.0"}},{"v":0,"d":"0.0"},{"$nulls":3},{"$f":"IF(ISNA($H525),0,zeitausschnitt($G525,$H525,$L525,P$9,P$10))","v":0},{"$f":"IF(ISNA($H525),0,zeitausschnitt($G525,$H525,$L525,Q$9,Q$10))","v":0},0,0,0,0,0,0,0,0,0,0,0,0,0,0,0,0,0,0,0]
[35000,{"$f":"B525","v":35200},{"$f":"C525+1","v":35202},null,"Entwicklung",{"$f":"OFFSET(F526,-8,0)&\" \"&OFFSET(F526,-2,0)&\" \"&INDIRECT(OFFSET(F526,-8,0)&\"!A5\")","v":"Leer Konzept  Entwicklung"},{"$f":"G525","v":{"$error":"#N/A"}},{"$f":"H525","v":{"$error":"#N/A"}},{"$f":"\"Aus Top Down \"&OFFSET(I526,-8,-3)","v":"Aus Top Down Leer"},{"$f":"IF(ISNA(H526),0,1)","v":{"v":0,"d":"0.000"}},{"$f":"INDIRECT(\"'\"&OFFSET(K526,-8,-5)&\"'!C5\")","v":{"v":0,"d":"0.0"}},{"v":0,"d":"0.0"},{"$nulls":3},{"$f":"IF(ISNA($H526),0,zeitausschnitt($G526,$H526,$L526,P$9,P$10))","v":0},0,0,0,0,0,0,0,0,0,0,0,0,0,0,0,0,0,0,0,0]
[35000,{"$f":"B526","v":35200},{"$f":"C526+1","v":35203},null,"Test",{"$f":"OFFSET(F527,-9,0)&\" \"&OFFSET(F527,-3,0)&\" \"&INDIRECT(OFFSET(F527,-9,0)&\"!A6\")","v":"Leer Konzept  Test"},{"$f":"G526","v":{"$error":"#N/A"}},{"$f":"H526","v":{"$error":"#N/A"}},{"$f":"\"Aus Top Down \"&OFFSET(I527,-9,-3)","v":"Aus Top Down Leer"},{"$f":"IF(ISNA(H527),0,1)","v":{"v":0,"d":"0.000"}},{"$f":"INDIRECT(\"'\"&OFFSET(K527,-9,-5)&\"'!C6\")","v":{"v":0,"d":"0.0"}},{"v":0,"d":"0.0"},{"$nulls":3},0,0,0,0,0,0,0,0,0,0,0,0,0,0,0,0,0,0,0,0,0]
[35000,{"$nulls":10},""]
[35000,{"$f":"B524+100","v":35300},{"$nulls":3},{"$f":"INDIRECT(OFFSET(F529,-11,0)&\"!D1\")","v":"Entwicklung"},{"$f":"MIN(G530:G532)","v":{"$error":"#N/A"}},{"$f":"MAX(H530:H532)","v":{"$error":"#N/A"}},{"$nulls":3},"",{"$f":"SUMIF(B$12:B$519,B529,L$12:L$519)","v":{"v":0,"d":"0.0"}}]
[35000,{"$f":"B529","v":35300},{"$f":"B529+1","v":35301},null,"PL",{"$f":"OFFSET(F530,-12,0)&\" \"&OFFSET(F530,-1,0)&\" \"&INDIRECT(OFFSET(F530,-12,0)&\"!A4\")","v":"Leer Entwicklung Projektleitung"},{"$f":"VLOOKUP(OFFSET(G530,-12,-1),Projektübersicht,5,0)","v":{"$error":"#N/A"}},{"$f":"VLOOKUP(OFFSET(H530,-12,-2),Projektübersicht,6,0)","v":{"$error":"#N/A"}},{"$f":"\"Aus Top Down \"&OFFSET(I530,-12,-3)","v":"Aus Top Down Leer"},{"$f":"IF(ISNA(H530),0,1)","v":{"v":0,"d":"0.000"}},{"$f":"INDIRECT(\"'\"&OFFSET(K530,-12,-5)&\"'!D4\")","v":{"v":0,"d":"0.0"}},{"v":0,"d":"0.0"},{"$nulls":3},{"$f":"IF(ISNA($H530),0,zeitausschnitt($G530,$H530,$L530,P$9,P$10))","v":0},{"$f":"IF(ISNA($H530),0,zeitausschnitt($G530,$H530,$L530,Q$9,Q$10))","v":0},0,0,0,0,0,0,0,0,0,0,0,0,0,0,0,0,0,0,0]
[35000,{"$f":"B530","v":35300},{"$f":"C530+1","v":35302},null,"Entwicklung",{"$f":"OFFSET(F531,-13,0)&\" \"&OFFSET(F531,-2,0)&\" \"&INDIRECT(OFFSET(F531,-13,0)&\"!A5\")","v":"Leer Entwicklung Entwicklung"},{"$f":"G530","v":{"$error":"#N/A"}},{"$f":"H530","v":{"$error":"#N/A"}},{"$f":"\"Aus Top Down \"&OFFSET(I531,-13,-3)","v":"Aus Top Down Leer"},{"$f":"IF(ISNA(H531),0,1)","v":{"v":0,"d":"0.000"}},{"$f":"INDIRECT(\"'\"&OFFSET(K531,-13,-5)&\"'!D5\")","v":{"v":0,"d":"0.0"}},{"v":0,"d":"0.0"},{"$nulls":3},{"$f":"IF(ISNA($H531),0,zeitausschnitt($G531,$H531,$L531,P$9,P$10))","v":0},0,0,0,0,0,0,0,0,0,0,0,0,0,0,0,0,0,0,0,0]
[35000,{"$f":"B531","v":35300},{"$f":"C531+1","v":35303},null,"Test",{"$f":"OFFSET(F532,-14,0)&\" \"&OFFSET(F532,-3,0)&\" \"&INDIRECT(OFFSET(F532,-14,0)&\"!A6\")","v":"Leer Entwicklung Test"},{"$f":"G531","v":{"$error":"#N/A"}},{"$f":"H531","v":{"$error":"#N/A"}},{"$f":"\"Aus Top Down \"&OFFSET(I532,-14,-3)","v":"Aus Top Down Leer"},{"$f":"IF(ISNA(H532),0,1)","v":{"v":0,"d":"0.000"}},{"$f":"INDIRECT(\"'\"&OFFSET(K532,-14,-5)&\"'!D6\")","v":{"v":0,"d":"0.0"}},{"v":0,"d":"0.0"},{"$nulls":3},0,0,0,0,0,0,0,0,0,0,0,0,0,0,0,0,0,0,0,0,0]
[35000,{"$nulls":10},""]
[35000,{"$f":"B529+100","v":35400},{"$nulls":3},{"$f":"INDIRECT(OFFSET(F534,-16,0)&\"!E1\")","v":"Pflege"},{"$f":"MIN(G535:G537)","v":{"$error":"#N/A"}},{"$f":"MAX(H535:H537)","v":{"$error":"#N/A"}},{"$nulls":3},"",{"$f":"SUMIF(B$12:B$519,B534,L$12:L$519)","v":{"v":0,"d":"0.0"}}]
[35000,{"$f":"B534","v":35400},{"$f":"B534+1","v":35401},null,"PL",{"$f":"OFFSET(F535,-17,0)&\" \"&OFFSET(F535,-1,0)&\" \"&INDIRECT(OFFSET(F535,-17,0)&\"!A4\")","v":"Leer Pflege Projektleitung"},{"$f":"VLOOKUP(OFFSET(G535,-17,-1),Projektübersicht,6,0)","v":{"$error":"#N/A"}},{"$f":"VLOOKUP(OFFSET(H535,-17,-2),Projektübersicht,7,0)","v":{"$error":"#N/A"}},{"$f":"\"Aus Top Down \"&OFFSET(I535,-17,-3)","v":"Aus Top Down Leer"},{"$f":"IF(ISNA(H535),0,1)","v":{"v":0,"d":"0.000"}},{"$f":"INDIRECT(\"'\"&OFFSET(K535,-17,-5)&\"'!E4\")","v":{"v":0,"d":"0.0"}},{"v":0,"d":"0.0"},{"$nulls":3},{"$f":"IF(ISNA($H535),0,zeitausschnitt($G535,$H535,$L535,P$9,P$10))","v":0},{"$f":"IF(ISNA($H535),0,zeitausschnitt($G535,$H535,$L535,Q$9,Q$10))","v":0},0,0,0,0,0,0,0,0,0,0,0,0,0,0,0,0,0,0,0]
[35000,{"$f":"B535","v":35400},{"$f":"C535+1","v":35402},null,"Entwicklung",{"$f":"OFFSET(F536,-18,0)&\" \"&OFFSET(F536,-2,0)&\" \"&INDIRECT(OFFSET(F536,-18,0)&\"!A5\")","v":"Leer Pflege Entwicklung"},{"$f":"G535","v":{"$error":"#N/A"}},{"$f":"H535","v":{"$error":"#N/A"}},{"$f":"\"Aus Top Down \"&OFFSET(I536,-18,-3)","v":"Aus Top Down Leer"},{"$f":"IF(ISNA(H536),0,1)","v":{"v":0,"d":"0.000"}},{"$f":"INDIRECT(\"'\"&OFFSET(K536,-18,-5)&\"'!E5\")","v":{"v":0,"d":"0.0"}},{"v":0,"d":"0.0"},{"$nulls":3},{"$f":"IF(ISNA($H536),0,zeitausschnitt($G536,$H536,$L536,P$9,P$10))","v":0},0,0,0,0,0,0,0,0,0,0,0,0,0,0,0,0,0,0,0,0]
[35000,{"$f":"B536","v":35400},{"$f":"C536+1","v":35403},null,"Test",{"$f":"OFFSET(F537,-19,0)&\" \"&OFFSET(F537,-3,0)&\" \"&INDIRECT(OFFSET(F537,-19,0)&\"!A6\")","v":"Leer Pflege Test"},{"$f":"G536","v":{"$error":"#N/A"}},{"$f":"H536","v":{"$error":"#N/A"}},{"$f":"\"Aus Top Down \"&OFFSET(I537,-19,-3)","v":"Aus Top Down Leer"},{"$f":"IF(ISNA(H537),0,1)","v":{"v":0,"d":"0.000"}},{"$f":"INDIRECT(\"'\"&OFFSET(K537,-19,-5)&\"'!E6\")","v":{"v":0,"d":"0.0"}},{"v":0,"d":"0.0"},{"$nulls":3},0,0,0,0,0,0,0,0,0,0,0,0,0,0,0,0,0,0,0,0,0]
[35000,{"$nulls":10},""]
[{"$nulls":11},{"$f":"IF(AND(J539<>\"\",K539<>\"\"),J539*K539,\"\")","v":""}]
[{"$f":"A518+1000","v":36000},{"$nulls":4},{"$f":"INDIRECT(CONCATENATE(\"Übersicht!C\",TEXT((A540-10000)/1000,0)))","v":"Leer"},{"$f":"MIN(G541:G555)","v":{"$error":"#N/A"}},{"$f":"MAX(H541:H555)","v":{"$error":"#N/A"}},{"$nulls":3},{"$f":"IF(AND(J540<>\"\",K540<>\"\"),J540*K540,\"\")","v":""},{"$f":"SUMIF(A$12:A$519,A540,L$12:L$519)","v":{"v":0,"d":"0.0"}},null,{"$f":"F540","v":"Leer"},{"$f":"SUM(P542:P559)","v":0},{"$f":"SUM(Q542:Q559)","v":0},0,0,0,0,0,0,0,0,0,0,0,0,0,0,0,0,0,0,0]
[{"$f":"A540","v":36000},{"$f":"A540+100","v":36100},{"$nulls":3},{"$f":"INDIRECT(OFFSET(F541,-1,0)&\"!B1\")","v":"Studie"},{"$f":"MIN(G542:G544)","v":"00:00:00"},{"$f":"MAX(H542:H544)","v":{"$error":"#N/A"}},{"$nulls":3},"",{"$f":"SUMIF(B$12:B$519,B541,L$12:L$519)","v":{"v":0,"d":"0.0"}}]
[{"$f":"A541","v":36000},{"$f":"B541","v":36100},{"$f":"B541+1","v":36101},null,"PL",{"$f":"OFFSET(F542,-2,0)&\" \"&OFFSET(F542,-1,0)&\" \"&INDIRECT(OFFSET(F542,-2,0)&\"!A4\")","v":"Leer Studie Projektleitung"},{"$f":"VLOOKUP(OFFSET(G542,-2,-1),Projektübersicht,3,0)","v":"00:00:00"},{"$f":"VLOOKUP(OFFSET(H542,-2,-2),Projektübersicht,4,0)","v":{"$error":"#N/A"}},{"$f":"\"Aus Top Down \"&OFFSET(I542,-2,-3)","v":"Aus Top Down Leer"},{"$f":"IF(ISNA(H542),0,1)","v":{"v":0,"d":"0.000"}},{"$f":"INDIRECT(\"'\"&OFFSET(K542,-2,-5)&\"'!B4\")","v":{"v":0,"d":"0.0"}},{"v":0,"d":"0.0"},{"$nulls":3},{"$f":"IF(ISNA($H542),0,zeitausschnitt($G542,$H542,$L542,P$9,P$10))","v":0},{"$f":"IF(ISNA($H542),0,zeitausschnitt($G542,$H542,$L542,Q$9,Q$10))","v":0},0,0,0,0,0,0,0,0,0,0,0,0,0,0,0,0,0,0,0]
[{"$f":"A542","v":36000},{"$f":"B542","v":36100},{"$f":"C542+1","v":36102},null,"Entwicklung",{"$f":"OFFSET(F543,-3,0)&\" \"&OFFSET(F543,-2,0)&\" \"&INDIRECT(OFFSET(F543,-3,0)&\"!A5\")","v":"Leer Studie Entwicklung"},{"$f":"G542","v":"00:00:00"},{"$f":"H542","v":{"$error":"#N/A"}},{"$f":"\"Aus Top Down \"&OFFSET(I543,-3,-3)","v":"Aus Top Down Leer"},{"$f":"IF(ISNA(H543),0,1)","v":{"v":0,"d":"0.000"}},{"$f":"INDIRECT(\"'\"&OFFSET(K543,-3,-5)&\"'!B5\")","v":{"v":0,"d":"0.0"}},{"v":0,"d":"0.0"},{"$nulls":3},{"$f":"IF(ISNA($H543),0,zeitausschnitt($G543,$H543,$L543,P$9,P$10))","v":0},0,0,0,0,0,0,0,0,0,0,0,0,0,0,0,0,0,0,0,0]
[36000,{"$f":"B543","v":36100},{"$f":"C543+1","v":36103},null,"Test",{"$f":"OFFSET(F544,-4,0)&\" \"&OFFSET(F544,-3,0)&\" \"&INDIRECT(OFFSET(F544,-4,0)&\"!A6\")","v":"Leer Studie Test"},{"$f":"G543","v":"00:00:00"},{"$f":"H543","v":{"$error":"#N/A"}},{"$f":"\"Aus Top Down \"&OFFSET(I544,-4,-3)","v":"Aus Top Down Leer"},{"$f":"IF(ISNA(H544),0,1)","v":{"v":0,"d":"0.000"}},{"$f":"INDIRECT(\"'\"&OFFSET(K544,-4,-5)&\"'!B6\")","v":{"v":0,"d":"0.0"}},{"v":0,"d":"0.0"},{"$nulls":3},0,0,0,0,0,0,0,0,0,0,0,0,0,0,0,0,0,0,0,0,0]
[36000,{"$nulls":10},""]
[36000,{"$f":"B541+100","v":36200},{"$nulls":3},{"$f":"INDIRECT(OFFSET(F546,-6,0)&\"!C1\")","v":"Konzept "},{"$f":"MIN(G547:G549)","v":{"$error":"#N/A"}},{"$f":"MAX(H547:H549)","v":{"$error":"#N/A"}},{"$nulls":3},"",{"$f":"SUMIF(B$12:B$519,B546,L$12:L$519)","v":{"v":0,"d":"0.0"}}]
[36000,{"$f":"B546","v":36200},{"$f":"B546+1","v":36201},null,"PL",{"$f":"OFFSET(F547,-7,0)&\" \"&OFFSET(F547,-1,0)&\" \"&INDIRECT(OFFSET(F547,-7,0)&\"!A4\")","v":"Leer Konzept  Projektleitung"},{"$f":"VLOOKUP(OFFSET(G547,-7,-1),Projektübersicht,4,0)","v":{"$error":"#N/A"}},{"$f":"VLOOKUP(OFFSET(H547,-7,-2),Projektübersicht,5,0)","v":{"$error":"#N/A"}},{"$f":"\"Aus Top Down \"&OFFSET(I547,-7,-3)","v":"Aus Top Down Leer"},{"$f":"IF(ISNA(H547),0,1)","v":{"v":0,"d":"0.000"}},{"$f":"INDIRECT(\"'\"&OFFSET(K547,-7,-5)&\"'!C4\")","v":{"v":0,"d":"0.0"}},{"v":0,"d":"0.0"},{"$nulls":3},{"$f":"IF(ISNA($H547),0,zeitausschnitt($G547,$H547,$L547,P$9,P$10))","v":0},{"$f":"IF(ISNA($H547),0,zeitausschnitt($G547,$H547,$L547,Q$9,Q$10))","v":0},0,0,0,0,0,0,0,0,0,0,0,0,0,0,0,0,0,0,0]
[36000,{"$f":"B547","v":36200},{"$f":"C547+1","v":36202},null,"Entwicklung",{"$f":"OFFSET(F548,-8,0)&\" \"&OFFSET(F548,-2,0)&\" \"&INDIRECT(OFFSET(F548,-8,0)&\"!A5\")","v":"Leer Konzept  Entwicklung"},{"$f":"G547","v":{"$error":"#N/A"}},{"$f":"H547","v":{"$error":"#N/A"}},{"$f":"\"Aus Top Down \"&OFFSET(I548,-8,-3)","v":"Aus Top Down Leer"},{"$f":"IF(ISNA(H548),0,1)","v":{"v":0,"d":"0.000"}},{"$f":"INDIRECT(\"'\"&OFFSET(K548,-8,-5)&\"'!C5\")","v":{"v":0,"d":"0.0"}},{"v":0,"d":"0.0"},{"$nulls":3},{"$f":"IF(ISNA($H548),0,zeitausschnitt($G548,$H548,$L548,P$9,P$10))","v":0},0,0,0,0,0,0,0,0,0,0,0,0,0,0,0,0,0,0,0,0]
[36000,{"$f":"B548","v":36200},{"$f":"C548+1","v":36203},null,"Test",{"$f":"OFFSET(F549,-9,0)&\" \"&OFFSET(F549,-3,0)&\" \"&INDIRECT(OFFSET(F549,-9,0)&\"!A6\")","v":"Leer Konzept  Test"},{"$f":"G548","v":{"$error":"#N/A"}},{"$f":"H548","v":{"$error":"#N/A"}},{"$f":"\"Aus Top Down \"&OFFSET(I549,-9,-3)","v":"Aus Top Down Leer"},{"$f":"IF(ISNA(H549),0,1)","v":{"v":0,"d":"0.000"}},{"$f":"INDIRECT(\"'\"&OFFSET(K549,-9,-5)&\"'!C6\")","v":{"v":0,"d":"0.0"}},{"v":0,"d":"0.0"},{"$nulls":3},0,0,0,0,0,0,0,0,0,0,0,0,0,0,0,0,0,0,0,0,0]
[36000,{"$nulls":10},""]
[36000,{"$f":"B546+100","v":36300},{"$nulls":3},{"$f":"INDIRECT(OFFSET(F551,-11,0)&\"!D1\")","v":"Entwicklung"},{"$f":"MIN(G552:G554)","v":{"$error":"#N/A"}},{"$f":"MAX(H552:H554)","v":{"$error":"#N/A"}},{"$nulls":3},"",{"$f":"SUMIF(B$12:B$519,B551,L$12:L$519)","v":{"v":0,"d":"0.0"}}]
[36000,{"$f":"B551","v":36300},{"$f":"B551+1","v":36301},null,"PL",{"$f":"OFFSET(F552,-12,0)&\" \"&OFFSET(F552,-1,0)&\" \"&INDIRECT(OFFSET(F552,-12,0)&\"!A4\")","v":"Leer Entwicklung Projektleitung"},{"$f":"VLOOKUP(OFFSET(G552,-12,-1),Projektübersicht,5,0)","v":{"$error":"#N/A"}},{"$f":"VLOOKUP(OFFSET(H552,-12,-2),Projektübersicht,6,0)","v":{"$error":"#N/A"}},{"$f":"\"Aus Top Down \"&OFFSET(I552,-12,-3)","v":"Aus Top Down Leer"},{"$f":"IF(ISNA(H552),0,1)","v":{"v":0,"d":"0.000"}},{"$f":"INDIRECT(\"'\"&OFFSET(K552,-12,-5)&\"'!D4\")","v":{"v":0,"d":"0.0"}},{"v":0,"d":"0.0"},{"$nulls":3},{"$f":"IF(ISNA($H552),0,zeitausschnitt($G552,$H552,$L552,P$9,P$10))","v":0},{"$f":"IF(ISNA($H552),0,zeitausschnitt($G552,$H552,$L552,Q$9,Q$10))","v":0},0,0,0,0,0,0,0,0,0,0,0,0,0,0,0,0,0,0,0]
[36000,{"$f":"B552","v":36300},{"$f":"C552+1","v":36302},null,"Entwicklung",{"$f":"OFFSET(F553,-13,0)&\" \"&OFFSET(F553,-2,0)&\" \"&INDIRECT(OFFSET(F553,-13,0)&\"!A5\")","v":"Leer Entwicklung Entwicklung"},{"$f":"G552","v":{"$error":"#N/A"}},{"$f":"H552","v":{"$error":"#N/A"}},{"$f":"\"Aus Top Down \"&OFFSET(I553,-13,-3)","v":"Aus Top Down Leer"},{"$f":"IF(ISNA(H553),0,1)","v":{"v":0,"d":"0.000"}},{"$f":"INDIRECT(\"'\"&OFFSET(K553,-13,-5)&\"'!D5\")","v":{"v":0,"d":"0.0"}},{"v":0,"d":"0.0"},{"$nulls":3},{"$f":"IF(ISNA($H553),0,zeitausschnitt($G553,$H553,$L553,P$9,P$10))","v":0},0,0,0,0,0,0,0,0,0,0,0,0,0,0,0,0,0,0,0,0]
[36000,{"$f":"B553","v":36300},{"$f":"C553+1","v":36303},null,"Test",{"$f":"OFFSET(F554,-14,0)&\" \"&OFFSET(F554,-3,0)&\" \"&INDIRECT(OFFSET(F554,-14,0)&\"!A6\")","v":"Leer Entwicklung Test"},{"$f":"G553","v":{"$error":"#N/A"}},{"$f":"H553","v":{"$error":"#N/A"}},{"$f":"\"Aus Top Down \"&OFFSET(I554,-14,-3)","v":"Aus Top Down Leer"},{"$f":"IF(ISNA(H554),0,1)","v":{"v":0,"d":"0.000"}},{"$f":"INDIRECT(\"'\"&OFFSET(K554,-14,-5)&\"'!D6\")","v":{"v":0,"d":"0.0"}},{"v":0,"d":"0.0"},{"$nulls":3},0,0,0,0,0,0,0,0,0,0,0,0,0,0,0,0,0,0,0,0,0]
[36000,{"$nulls":10},""]
[36000,{"$f":"B551+100","v":36400},{"$nulls":3},{"$f":"INDIRECT(OFFSET(F556,-16,0)&\"!E1\")","v":"Pflege"},{"$f":"MIN(G557:G559)","v":{"$error":"#N/A"}},{"$f":"MAX(H557:H559)","v":{"$error":"#N/A"}},{"$nulls":3},"",{"$f":"SUMIF(B$12:B$519,B556,L$12:L$519)","v":{"v":0,"d":"0.0"}}]
[36000,{"$f":"B556","v":36400},{"$f":"B556+1","v":36401},null,"PL",{"$f":"OFFSET(F557,-17,0)&\" \"&OFFSET(F557,-1,0)&\" \"&INDIRECT(OFFSET(F557,-17,0)&\"!A4\")","v":"Leer Pflege Projektleitung"},{"$f":"VLOOKUP(OFFSET(G557,-17,-1),Projektübersicht,6,0)","v":{"$error":"#N/A"}},{"$f":"VLOOKUP(OFFSET(H557,-17,-2),Projektübersicht,7,0)","v":{"$error":"#N/A"}},{"$f":"\"Aus Top Down \"&OFFSET(I557,-17,-3)","v":"Aus Top Down Leer"},{"$f":"IF(ISNA(H557),0,1)","v":{"v":0,"d":"0.000"}},{"$f":"INDIRECT(\"'\"&OFFSET(K557,-17,-5)&\"'!E4\")","v":{"v":0,"d":"0.0"}},{"v":0,"d":"0.0"},{"$nulls":3},{"$f":"IF(ISNA($H557),0,zeitausschnitt($G557,$H557,$L557,P$9,P$10))","v":0},{"$f":"IF(ISNA($H557),0,zeitausschnitt($G557,$H557,$L557,Q$9,Q$10))","v":0},0,0,0,0,0,0,0,0,0,0,0,0,0,0,0,0,0,0,0]
[36000,{"$f":"B557","v":36400},{"$f":"C557+1","v":36402},null,"Entwicklung",{"$f":"OFFSET(F558,-18,0)&\" \"&OFFSET(F558,-2,0)&\" \"&INDIRECT(OFFSET(F558,-18,0)&\"!A5\")","v":"Leer Pflege Entwicklung"},{"$f":"G557","v":{"$error":"#N/A"}},{"$f":"H557","v":{"$error":"#N/A"}},{"$f":"\"Aus Top Down \"&OFFSET(I558,-18,-3)","v":"Aus Top Down Leer"},{"$f":"IF(ISNA(H558),0,1)","v":{"v":0,"d":"0.000"}},{"$f":"INDIRECT(\"'\"&OFFSET(K558,-18,-5)&\"'!E5\")","v":{"v":0,"d":"0.0"}},{"v":0,"d":"0.0"},{"$nulls":3},{"$f":"IF(ISNA($H558),0,zeitausschnitt($G558,$H558,$L558,P$9,P$10))","v":0},0,0,0,0,0,0,0,0,0,0,0,0,0,0,0,0,0,0,0,0]
[36000,{"$f":"B558","v":36400},{"$f":"C558+1","v":36403},null,"Test",{"$f":"OFFSET(F559,-19,0)&\" \"&OFFSET(F559,-3,0)&\" \"&INDIRECT(OFFSET(F559,-19,0)&\"!A6\")","v":"Leer Pflege Test"},{"$f":"G558","v":{"$error":"#N/A"}},{"$f":"H558","v":{"$error":"#N/A"}},{"$f":"\"Aus Top Down \"&OFFSET(I559,-19,-3)","v":"Aus Top Down Leer"},{"$f":"IF(ISNA(H559),0,1)","v":{"v":0,"d":"0.000"}},{"$f":"INDIRECT(\"'\"&OFFSET(K559,-19,-5)&\"'!E6\")","v":{"v":0,"d":"0.0"}},{"v":0,"d":"0.0"},{"$nulls":3},0,0,0,0,0,0,0,0,0,0,0,0,0,0,0,0,0,0,0,0,0]
[36000,{"$nulls":10},""]
[{"$nulls":11},{"$f":"IF(AND(J561<>\"\",K561<>\"\"),J561*K561,\"\")","v":""}]
[{"$f":"A540+1000","v":37000},{"$nulls":4},{"$f":"INDIRECT(CONCATENATE(\"Übersicht!C\",TEXT((A562-10000)/1000,0)))","v":"Leer"},{"$f":"MIN(G563:G577)","v":{"$error":"#N/A"}},{"$f":"MAX(H563:H577)","v":{"$error":"#N/A"}},{"$nulls":3},{"$f":"IF(AND(J562<>\"\",K562<>\"\"),J562*K562,\"\")","v":""},{"$f":"SUMIF(A$12:A$519,A562,L$12:L$519)","v":{"v":0,"d":"0.0"}},null,{"$f":"F562","v":"Leer"},{"$f":"SUM(P564:P581)","v":0},{"$f":"SUM(Q564:Q581)","v":0},0,0,0,0,0,0,0,0,0,0,0,0,0,0,0,0,0,0,0]
[{"$f":"A562","v":37000},{"$f":"A562+100","v":37100},{"$nulls":3},{"$f":"INDIRECT(OFFSET(F563,-1,0)&\"!B1\")","v":"Studie"},{"$f":"MIN(G564:G566)","v":"00:00:00"},{"$f":"MAX(H564:H566)","v":{"$error":"#N/A"}},{"$nulls":3},"",{"$f":"SUMIF(B$12:B$519,B563,L$12:L$519)","v":{"v":0,"d":"0.0"}}]
[{"$f":"A563","v":37000},{"$f":"B563","v":37100},{"$f":"B563+1","v":37101},null,"PL",{"$f":"OFFSET(F564,-2,0)&\" \"&OFFSET(F564,-1,0)&\" \"&INDIRECT(OFFSET(F564,-2,0)&\"!A4\")","v":"Leer Studie Projektleitung"},{"$f":"VLOOKUP(OFFSET(G564,-2,-1),Projektübersicht,3,0)","v":"00:00:00"},{"$f":"VLOOKUP(OFFSET(H564,-2,-2),Projektübersicht,4,0)","v":{"$error":"#N/A"}},{"$f":"\"Aus Top Down \"&OFFSET(I564,-2,-3)","v":"Aus Top Down Leer"},{"$f":"IF(ISNA(H564),0,1)","v":{"v":0,"d":"0.000"}},{"$f":"INDIRECT(\"'\"&OFFSET(K564,-2,-5)&\"'!B4\")","v":{"v":0,"d":"0.0"}},{"v":0,"d":"0.0"},{"$nulls":3},{"$f":"IF(ISNA($H564),0,zeitausschnitt($G564,$H564,$L564,P$9,P$10))","v":0},{"$f":"IF(ISNA($H564),0,zeitausschnitt($G564,$H564,$L564,Q$9,Q$10))","v":0},0,0,0,0,0,0,0,0,0,0,0,0,0,0,0,0,0,0,0]
[{"$f":"A564","v":37000},{"$f":"B564","v":37100},{"$f":"C564+1","v":37102},null,"Entwicklung",{"$f":"OFFSET(F565,-3,0)&\" \"&OFFSET(F565,-2,0)&\" \"&INDIRECT(OFFSET(F565,-3,0)&\"!A5\")","v":"Leer Studie Entwicklung"},{"$f":"G564","v":"00:00:00"},{"$f":"H564","v":{"$error":"#N/A"}},{"$f":"\"Aus Top Down \"&OFFSET(I565,-3,-3)","v":"Aus Top Down Leer"},{"$f":"IF(ISNA(H565),0,1)","v":{"v":0,"d":"0.000"}},{"$f":"INDIRECT(\"'\"&OFFSET(K565,-3,-5)&\"'!B5\")","v":{"v":0,"d":"0.0"}},{"v":0,"d":"0.0"},{"$nulls":3},{"$f":"IF(ISNA($H565),0,zeitausschnitt($G565,$H565,$L565,P$9,P$10))","v":0},0,0,0,0,0,0,0,0,0,0,0,0,0,0,0,0,0,0,0,0]
[37000,{"$f":"B565","v":37100},{"$f":"C565+1","v":37103},null,"Test",{"$f":"OFFSET(F566,-4,0)&\" \"&OFFSET(F566,-3,0)&\" \"&INDIRECT(OFFSET(F566,-4,0)&\"!A6\")","v":"Leer Studie Test"},{"$f":"G565","v":"00:00:00"},{"$f":"H565","v":{"$error":"#N/A"}},{"$f":"\"Aus Top Down \"&OFFSET(I566,-4,-3)","v":"Aus Top Down Leer"},{"$f":"IF(ISNA(H566),0,1)","v":{"v":0,"d":"0.000"}},{"$f":"INDIRECT(\"'\"&OFFSET(K566,-4,-5)&\"'!B6\")","v":{"v":0,"d":"0.0"}},{"v":0,"d":"0.0"},{"$nulls":3},0,0,0,0,0,0,0,0,0,0,0,0,0,0,0,0,0,0,0,0,0]
[37000,{"$nulls":10},""]
[37000,{"$f":"B563+100","v":37200},{"$nulls":3},{"$f":"INDIRECT(OFFSET(F568,-6,0)&\"!C1\")","v":"Konzept "},{"$f":"MIN(G569:G571)","v":{"$error":"#N/A"}},{"$f":"MAX(H569:H571)","v":{"$error":"#N/A"}},{"$nulls":3},"",{"$f":"SUMIF(B$12:B$519,B568,L$12:L$519)","v":{"v":0,"d":"0.0"}}]
[37000,{"$f":"B568","v":37200},{"$f":"B568+1","v":37201},null,"PL",{"$f":"OFFSET(F569,-7,0)&\" \"&OFFSET(F569,-1,0)&\" \"&INDIRECT(OFFSET(F569,-7,0)&\"!A4\")","v":"Leer Konzept  Projektleitung"},{"$f":"VLOOKUP(OFFSET(G569,-7,-1),Projektübersicht,4,0)","v":{"$error":"#N/A"}},{"$f":"VLOOKUP(OFFSET(H569,-7,-2),Projektübersicht,5,0)","v":{"$error":"#N/A"}},{"$f":"\"Aus Top Down \"&OFFSET(I569,-7,-3)","v":"Aus Top Down Leer"},{"$f":"IF(ISNA(H569),0,1)","v":{"v":0,"d":"0.000"}},{"$f":"INDIRECT(\"'\"&OFFSET(K569,-7,-5)&\"'!C4\")","v":{"v":0,"d":"0.0"}},{"v":0,"d":"0.0"},{"$nulls":3},{"$f":"IF(ISNA($H569),0,zeitausschnitt($G569,$H569,$L569,P$9,P$10))","v":0},{"$f":"IF(ISNA($H569),0,zeitausschnitt($G569,$H569,$L569,Q$9,Q$10))","v":0},0,0,0,0,0,0,0,0,0,0,0,0,0,0,0,0,0,0,0]
[37000,{"$f":"B569","v":37200},{"$f":"C569+1","v":37202},null,"Entwicklung",{"$f":"OFFSET(F570,-8,0)&\" \"&OFFSET(F570,-2,0)&\" \"&INDIRECT(OFFSET(F570,-8,0)&\"!A5\")","v":"Leer Konzept  Entwicklung"},{"$f":"G569","v":{"$error":"#N/A"}},{"$f":"H569","v":{"$error":"#N/A"}},{"$f":"\"Aus Top Down \"&OFFSET(I570,-8,-3)","v":"Aus Top Down Leer"},{"$f":"IF(ISNA(H570),0,1)","v":{"v":0,"d":"0.000"}},{"$f":"INDIRECT(\"'\"&OFFSET(K570,-8,-5)&\"'!C5\")","v":{"v":0,"d":"0.0"}},{"v":0,"d":"0.0"},{"$nulls":3},{"$f":"IF(ISNA($H570),0,zeitausschnitt($G570,$H570,$L570,P$9,P$10))","v":0},0,0,0,0,0,0,0,0,0,0,0,0,0,0,0,0,0,0,0,0]
[37000,{"$f":"B570","v":37200},{"$f":"C570+1","v":37203},null,"Test",{"$f":"OFFSET(F571,-9,0)&\" \"&OFFSET(F571,-3,0)&\" \"&INDIRECT(OFFSET(F571,-9,0)&\"!A6\")","v":"Leer Konzept  Test"},{"$f":"G570","v":{"$error":"#N/A"}},{"$f":"H570","v":{"$error":"#N/A"}},{"$f":"\"Aus Top Down \"&OFFSET(I571,-9,-3)","v":"Aus Top Down Leer"},{"$f":"IF(ISNA(H571),0,1)","v":{"v":0,"d":"0.000"}},{"$f":"INDIRECT(\"'\"&OFFSET(K571,-9,-5)&\"'!C6\")","v":{"v":0,"d":"0.0"}},{"v":0,"d":"0.0"},{"$nulls":3},0,0,0,0,0,0,0,0,0,0,0,0,0,0,0,0,0,0,0,0,0]
[37000,{"$nulls":10},""]
[37000,{"$f":"B568+100","v":37300},{"$nulls":3},{"$f":"INDIRECT(OFFSET(F573,-11,0)&\"!D1\")","v":"Entwicklung"},{"$f":"MIN(G574:G576)","v":{"$error":"#N/A"}},{"$f":"MAX(H574:H576)","v":{"$error":"#N/A"}},{"$nulls":3},"",{"$f":"SUMIF(B$12:B$519,B573,L$12:L$519)","v":{"v":0,"d":"0.0"}}]
[37000,{"$f":"B573","v":37300},{"$f":"B573+1","v":37301},null,"PL",{"$f":"OFFSET(F574,-12,0)&\" \"&OFFSET(F574,-1,0)&\" \"&INDIRECT(OFFSET(F574,-12,0)&\"!A4\")","v":"Leer Entwicklung Projektleitung"},{"$f":"VLOOKUP(OFFSET(G574,-12,-1),Projektübersicht,5,0)","v":{"$error":"#N/A"}},{"$f":"VLOOKUP(OFFSET(H574,-12,-2),Projektübersicht,6,0)","v":{"$error":"#N/A"}},{"$f":"\"Aus Top Down \"&OFFSET(I574,-12,-3)","v":"Aus Top Down Leer"},{"$f":"IF(ISNA(H574),0,1)","v":{"v":0,"d":"0.000"}},{"$f":"INDIRECT(\"'\"&OFFSET(K574,-12,-5)&\"'!D4\")","v":{"v":0,"d":"0.0"}},{"v":0,"d":"0.0"},{"$nulls":3},{"$f":"IF(ISNA($H574),0,zeitausschnitt($G574,$H574,$L574,P$9,P$10))","v":0},{"$f":"IF(ISNA($H574),0,zeitausschnitt($G574,$H574,$L574,Q$9,Q$10))","v":0},0,0,0,0,0,0,0,0,0,0,0,0,0,0,0,0,0,0,0]
[37000,{"$f":"B574","v":37300},{"$f":"C574+1","v":37302},null,"Entwicklung",{"$f":"OFFSET(F575,-13,0)&\" \"&OFFSET(F575,-2,0)&\" \"&INDIRECT(OFFSET(F575,-13,0)&\"!A5\")","v":"Leer Entwicklung Entwicklung"},{"$f":"G574","v":{"$error":"#N/A"}},{"$f":"H574","v":{"$error":"#N/A"}},{"$f":"\"Aus Top Down \"&OFFSET(I575,-13,-3)","v":"Aus Top Down Leer"},{"$f":"IF(ISNA(H575),0,1)","v":{"v":0,"d":"0.000"}},{"$f":"INDIRECT(\"'\"&OFFSET(K575,-13,-5)&\"'!D5\")","v":{"v":0,"d":"0.0"}},{"v":0,"d":"0.0"},{"$nulls":3},{"$f":"IF(ISNA($H575),0,zeitausschnitt($G575,$H575,$L575,P$9,P$10))","v":0},0,0,0,0,0,0,0,0,0,0,0,0,0,0,0,0,0,0,0,0]
[37000,{"$f":"B575","v":37300},{"$f":"C575+1","v":37303},null,"Test",{"$f":"OFFSET(F576,-14,0)&\" \"&OFFSET(F576,-3,0)&\" \"&INDIRECT(OFFSET(F576,-14,0)&\"!A6\")","v":"Leer Entwicklung Test"},{"$f":"G575","v":{"$error":"#N/A"}},{"$f":"H575","v":{"$error":"#N/A"}},{"$f":"\"Aus Top Down \"&OFFSET(I576,-14,-3)","v":"Aus Top Down Leer"},{"$f":"IF(ISNA(H576),0,1)","v":{"v":0,"d":"0.000"}},{"$f":"INDIRECT(\"'\"&OFFSET(K576,-14,-5)&\"'!D6\")","v":{"v":0,"d":"0.0"}},{"v":0,"d":"0.0"},{"$nulls":3},0,0,0,0,0,0,0,0,0,0,0,0,0,0,0,0,0,0,0,0,0]
[37000,{"$nulls":10},""]
[37000,{"$f":"B573+100","v":37400},{"$nulls":3},{"$f":"INDIRECT(OFFSET(F578,-16,0)&\"!E1\")","v":"Pflege"},{"$f":"MIN(G579:G581)","v":{"$error":"#N/A"}},{"$f":"MAX(H579:H581)","v":{"$error":"#N/A"}},{"$nulls":3},"",{"$f":"SUMIF(B$12:B$519,B578,L$12:L$519)","v":{"v":0,"d":"0.0"}}]
[37000,{"$f":"B578","v":37400},{"$f":"B578+1","v":37401},null,"PL",{"$f":"OFFSET(F579,-17,0)&\" \"&OFFSET(F579,-1,0)&\" \"&INDIRECT(OFFSET(F579,-17,0)&\"!A4\")","v":"Leer Pflege Projektleitung"},{"$f":"VLOOKUP(OFFSET(G579,-17,-1),Projektübersicht,6,0)","v":{"$error":"#N/A"}},{"$f":"VLOOKUP(OFFSET(H579,-17,-2),Projektübersicht,7,0)","v":{"$error":"#N/A"}},{"$f":"\"Aus Top Down \"&OFFSET(I579,-17,-3)","v":"Aus Top Down Leer"},{"$f":"IF(ISNA(H579),0,1)","v":{"v":0,"d":"0.000"}},{"$f":"INDIRECT(\"'\"&OFFSET(K579,-17,-5)&\"'!E4\")","v":{"v":0,"d":"0.0"}},{"v":0,"d":"0.0"},{"$nulls":3},{"$f":"IF(ISNA($H579),0,zeitausschnitt($G579,$H579,$L579,P$9,P$10))","v":0},{"$f":"IF(ISNA($H579),0,zeitausschnitt($G579,$H579,$L579,Q$9,Q$10))","v":0},0,0,0,0,0,0,0,0,0,0,0,0,0,0,0,0,0,0,0]
[37000,{"$f":"B579","v":37400},{"$f":"C579+1","v":37402},null,"Entwicklung",{"$f":"OFFSET(F580,-18,0)&\" \"&OFFSET(F580,-2,0)&\" \"&INDIRECT(OFFSET(F580,-18,0)&\"!A5\")","v":"Leer Pflege Entwicklung"},{"$f":"G579","v":{"$error":"#N/A"}},{"$f":"H579","v":{"$error":"#N/A"}},{"$f":"\"Aus Top Down \"&OFFSET(I580,-18,-3)","v":"Aus Top Down Leer"},{"$f":"IF(ISNA(H580),0,1)","v":{"v":0,"d":"0.000"}},{"$f":"INDIRECT(\"'\"&OFFSET(K580,-18,-5)&\"'!E5\")","v":{"v":0,"d":"0.0"}},{"v":0,"d":"0.0"},{"$nulls":3},{"$f":"IF(ISNA($H580),0,zeitausschnitt($G580,$H580,$L580,P$9,P$10))","v":0},0,0,0,0,0,0,0,0,0,0,0,0,0,0,0,0,0,0,0,0]
[37000,{"$f":"B580","v":37400},{"$f":"C580+1","v":37403},null,"Test",{"$f":"OFFSET(F581,-19,0)&\" \"&OFFSET(F581,-3,0)&\" \"&INDIRECT(OFFSET(F581,-19,0)&\"!A6\")","v":"Leer Pflege Test"},{"$f":"G580","v":{"$error":"#N/A"}},{"$f":"H580","v":{"$error":"#N/A"}},{"$f":"\"Aus Top Down \"&OFFSET(I581,-19,-3)","v":"Aus Top Down Leer"},{"$f":"IF(ISNA(H581),0,1)","v":{"v":0,"d":"0.000"}},{"$f":"INDIRECT(\"'\"&OFFSET(K581,-19,-5)&\"'!E6\")","v":{"v":0,"d":"0.0"}},{"v":0,"d":"0.0"},{"$nulls":3},0,0,0,0,0,0,0,0,0,0,0,0,0,0,0,0,0,0,0,0,0]
[37000,{"$nulls":10},""]
[{"$nulls":11},{"$f":"IF(AND(J583<>\"\",K583<>\"\"),J583*K583,\"\")","v":""}]

{"sheet":"KPI","index":4,"n_rows":4,"n_cols":105,"rows_kept":4}
[]
["2013-01-01",{"$f":"A2+7","v":"2013-01-08"},"2013-01-15","2013-01-22","2013-01-29","2013-02-05","2013-02-12","2013-02-19","2013-02-26","2013-03-05","2013-03-12","2013-03-19","2013-03-26","2013-04-02","2013-04-09","2013-04-16","2013-04-23","2013-04-30","2013-05-07","2013-05-14","2013-05-21","2013-05-28","2013-06-04","2013-06-11","2013-06-18","2013-06-25","2013-07-02","2013-07-09","2013-07-16","2013-07-23","2013-07-30","2013-08-06","2013-08-13",{"$f":"AG2+7","v":"2013-08-20"},"2013-08-27","2013-09-03","2013-09-10","2013-09-17","2013-09-24","2013-10-01","2013-10-08","2013-10-15","2013-10-22","2013-10-29","2013-11-05","2013-11-12","2013-11-19","2013-11-26","2013-12-03","2013-12-10","2013-12-17","2013-12-24",{"$f":"AZ2+7","v":"2013-12-31"},"2014-01-07","2014-01-14","2014-01-21","2014-01-28","2014-02-04","2014-02-11","2014-02-18","2014-02-25","2014-03-04","2014-03-11","2014-03-18","2014-03-25","2014-04-01","2014-04-08","2014-04-15","2014-04-22","2014-04-29","2014-05-06","2014-05-13",{"$f":"BT2+7","v":"2014-05-20"},"2014-05-27","2014-06-03","2014-06-10","2014-06-17","2014-06-24","2014-07-01","2014-07-08","2014-07-15","2014-07-22","2014-07-29","2014-08-05","2014-08-12","2014-08-19","2014-08-26","2014-09-02","2014-09-09","2014-09-16","2014-09-23","2014-09-30","2014-10-07","2014-10-14","2014-10-21","2014-10-28","2014-11-04","2014-11-11","2014-11-18","2014-11-25","2014-12-02","2014-12-09","2014-12-16","2014-12-23","2014-12-30"]
[{"$f":"SUMIF(Arbeitsplan!$G12:$G520,\"<=\"&A2,Arbeitsplan!$L12:$L520)","v":0},{"$f":"SUMIF(Arbeitsplan!$G12:$G520,\"<=\"&B2,Arbeitsplan!$L12:$L520)","v":0},{"$f":"SUMIF(Arbeitsplan!$G12:$G520,\"<=\"&C2,Arbeitsplan!$L12:$L520)","v":0},{"$f":"SUMIF(Arbeitsplan!$G12:$G520,\"<=\"&D2,Arbeitsplan!$L12:$L520)","v":0},{"$f":"SUMIF(Arbeitsplan!$G12:$G520,\"<=\"&E2,Arbeitsplan!$L12:$L520)","v":0},{"$f":"SUMIF(Arbeitsplan!$G12:$G520,\"<=\"&F2,Arbeitsplan!$L12:$L520)","v":0},{"$f":"SUMIF(Arbeitsplan!$G12:$G520,\"<=\"&G2,Arbeitsplan!$L12:$L520)","v":0},{"$f":"SUMIF(Arbeitsplan!$G12:$G520,\"<=\"&H2,Arbeitsplan!$L12:$L520)","v":0},{"$f":"SUMIF(Arbeitsplan!$G12:$G520,\"<=\"&I2,Arbeitsplan!$L12:$L520)","v":0},{"$f":"SUMIF(Arbeitsplan!$G12:$G520,\"<=\"&J2,Arbeitsplan!$L12:$L520)","v":0},{"$f":"SUMIF(Arbeitsplan!$G12:$G520,\"<=\"&K2,Arbeitsplan!$L12:$L520)","v":0},{"$f":"SUMIF(Arbeitsplan!$G12:$G520,\"<=\"&L2,Arbeitsplan!$L12:$L520)","v":0},{"$f":"SUMIF(Arbeitsplan!$G12:$G520,\"<=\"&M2,Arbeitsplan!$L12:$L520)","v":0},{"$f":"SUMIF(Arbeitsplan!$G12:$G520,\"<=\"&N2,Arbeitsplan!$L12:$L520)","v":0},{"$f":"SUMIF(Arbeitsplan!$G12:$G520,\"<=\"&O2,Arbeitsplan!$L12:$L520)","v":0},{"$f":"SUMIF(Arbeitsplan!$G12:$G520,\"<=\"&P2,Arbeitsplan!$L12:$L520)","v":0},{"$f":"SUMIF(Arbeitsplan!$G12:$G520,\"<=\"&Q2,Arbeitsplan!$L12:$L520)","v":0},{"$f":"SUMIF(Arbeitsplan!$G12:$G520,\"<=\"&R2,Arbeitsplan!$L12:$L520)","v":0},{"$f":"SUMIF(Arbeitsplan!$G12:$G520,\"<=\"&S2,Arbeitsplan!$L12:$L520)","v":0},{"$f":"SUMIF(Arbeitsplan!$G12:$G520,\"<=\"&T2,Arbeitsplan!$L12:$L520)","v":0},{"$f":"SUMIF(Arbeitsplan!$G12:$G520,\"<=\"&U2,Arbeitsplan!$L12:$L520)","v":0},{"$f":"SUMIF(Arbeitsplan!$G12:$G520,\"<=\"&V2,Arbeitsplan!$L12:$L520)","v":0},{"$f":"SUMIF(Arbeitsplan!$G12:$G520,\"<=\"&W2,Arbeitsplan!$L12:$L520)","v":0},{"$f":"SUMIF(Arbeitsplan!$G12:$G520,\"<=\"&X2,Arbeitsplan!$L12:$L520)","v":0},{"$f":"SUMIF(Arbeitsplan!$G12:$G520,\"<=\"&Y2,Arbeitsplan!$L12:$L520)","v":0},{"$f":"SUMIF(Arbeitsplan!$G12:$G520,\"<=\"&Z2,Arbeitsplan!$L12:$L520)","v":0},{"$f":"SUMIF(Arbeitsplan!$G12:$G520,\"<=\"&AA2,Arbeitsplan!$L12:$L520)","v":90},{"$f":"SUMIF(Arbeitsplan!$G12:$G520,\"<=\"&AB2,Arbeitsplan!$L12:$L520)","v":90},{"$f":"SUMIF(Arbeitsplan!$G12:$G520,\"<=\"&AC2,Arbeitsplan!$L12:$L520)","v":90},{"$f":"SUMIF(Arbeitsplan!$G12:$G520,\"<=\"&AD2,Arbeitsplan!$L12:$L520)","v":90},{"$f":"SUMIF(Arbeitsplan!$G12:$G520,\"<=\"&AE2,Arbeitsplan!$L12:$L520)","v":90},{"$f":"SUMIF(Arbeitsplan!$G12:$G520,\"<=\"&AF2,Arbeitsplan!$L12:$L520)","v":180},{"$f":"SUMIF(Arbeitsplan!$G12:$G520,\"<=\"&AG2,Arbeitsplan!$L12:$L520)","v":180},{"$f":"SUMIF(Arbeitsplan!$G12:$G520,\"<=\"&AH2,Arbeitsplan!$L12:$L520)","v":180},{"$f":"SUMIF(Arbeitsplan!$G12:$G520,\"<=\"&AI2,Arbeitsplan!$L12:$L520)","v":180},{"$f":"SUMIF(Arbeitsplan!$G12:$G520,\"<=\"&AJ2,Arbeitsplan!$L12:$L520)","v":360},{"$f":"SUMIF(Arbeitsplan!$G12:$G520,\"<=\"&AK2,Arbeitsplan!$L12:$L520)","v":360},{"$f":"SUMIF(Arbeitsplan!$G12:$G520,\"<=\"&AL2,Arbeitsplan!$L12:$L520)","v":360},{"$f":"SUMIF(Arbeitsplan!$G12:$G520,\"<=\"&AM2,Arbeitsplan!$L12:$L520)","v":360},{"$f":"SUMIF(Arbeitsplan!$G12:$G520,\"<=\"&AN2,Arbeitsplan!$L12:$L520)","v":360},{"$f":"SUMIF(Arbeitsplan!$G12:$G520,\"<=\"&AO2,Arbeitsplan!$L12:$L520)","v":450},{"$f":"SUMIF(Arbeitsplan!$G12:$G520,\"<=\"&AP2,Arbeitsplan!$L12:$L520)","v":450},{"$f":"SUMIF(Arbeitsplan!$G12:$G520,\"<=\"&AQ2,Arbeitsplan!$L12:$L520)","v":450},{"$f":"SUMIF(Arbeitsplan!$G12:$G520,\"<=\"&AR2,Arbeitsplan!$L12:$L520)","v":540},{"$f":"SUMIF(Arbeitsplan!$G12:$G520,\"<=\"&AS2,Arbeitsplan!$L12:$L520)","v":540},{"$f":"SUMIF(Arbeitsplan!$G12:$G520,\"<=\"&AT2,Arbeitsplan!$L12:$L520)","v":540},{"$f":"SUMIF(Arbeitsplan!$G12:$G520,\"<=\"&AU2,Arbeitsplan!$L12:$L520)","v":630},{"$f":"SUMIF(Arbeitsplan!$G12:$G520,\"<=\"&AV2,Arbeitsplan!$L12:$L520)","v":630},{"$f":"SUMIF(Arbeitsplan!$G12:$G520,\"<=\"&AW2,Arbeitsplan!$L12:$L520)","v":630},{"$f":"SUMIF(Arbeitsplan!$G12:$G520,\"<=\"&AX2,Arbeitsplan!$L12:$L520)","v":630},{"$f":"SUMIF(Arbeitsplan!$G12:$G520,\"<=\"&AY2,Arbeitsplan!$L12:$L520)","v":720},{"$f":"SUMIF(Arbeitsplan!$G12:$G520,\"<=\"&AZ2,Arbeitsplan!$L12:$L520)","v":720},{"$f":"SUMIF(Arbeitsplan!$G12:$G520,\"<=\"&BA2,Arbeitsplan!$L12:$L520)","v":810},{"$f":"SUMIF(Arbeitsplan!$G12:$G520,\"<=\"&BB2,Arbeitsplan!$L12:$L520)","v":810},{"$f":"SUMIF(Arbeitsplan!$G12:$G520,\"<=\"&BC2,Arbeitsplan!$L12:$L520)","v":810},{"$f":"SUMIF(Arbeitsplan!$G12:$G520,\"<=\"&BD2,Arbeitsplan!$L12:$L520)","v":810},{"$f":"SUMIF(Arbeitsplan!$G12:$G520,\"<=\"&BE2,Arbeitsplan!$L12:$L520)","v":810},{"$f":"SUMIF(Arbeitsplan!$G12:$G520,\"<=\"&BF2,Arbeitsplan!$L12:$L520)","v":900},{"$f":"SUMIF(Arbeitsplan!$G12:$G520,\"<=\"&BG2,Arbeitsplan!$L12:$L520)","v":900},{"$f":"SUMIF(Arbeitsplan!$G12:$G520,\"<=\"&BH2,Arbeitsplan!$L12:$L520)","v":900},{"$f":"SUMIF(Arbeitsplan!$G12:$G520,\"<=\"&BI2,Arbeitsplan!$L12:$L520)","v":990},{"$f":"SUMIF(Arbeitsplan!$G12:$G520,\"<=\"&BJ2,Arbeitsplan!$L12:$L520)","v":990},{"$f":"SUMIF(Arbeitsplan!$G12:$G520,\"<=\"&BK2,Arbeitsplan!$L12:$L520)","v":990},{"$f":"SUMIF(Arbeitsplan!$G12:$G520,\"<=\"&BL2,Arbeitsplan!$L12:$L520)","v":990},{"$f":"SUMIF(Arbeitsplan!$G12:$G520,\"<=\"&BM2,Arbeitsplan!$L12:$L520)","v":990},{"$f":"SUMIF(Arbeitsplan!$G12:$G520,\"<=\"&BN2,Arbeitsplan!$L12:$L520)","v":990},{"$f":"SUMIF(Arbeitsplan!$G12:$G520,\"<=\"&BO2,Arbeitsplan!$L12:$L520)","v":990},{"$f":"SUMIF(Arbeitsplan!$G12:$G520,\"<=\"&BP2,Arbeitsplan!$L12:$L520)","v":1080},{"$f":"SUMIF(Arbeitsplan!$G12:$G520,\"<=\"&BQ2,Arbeitsplan!$L12:$L520)","v":1080},{"$f":"SUMIF(Arbeitsplan!$G12:$G520,\"<=\"&BR2,Arbeitsplan!$L12:$L520)","v":1080},{"$f":"SUMIF(Arbeitsplan!$G12:$G520,\"<=\"&BS2,Arbeitsplan!$L12:$L520)","v":1080},{"$f":"SUMIF(Arbeitsplan!$G12:$G520,\"<=\"&BT2,Arbeitsplan!$L12:$L520)","v":1080},{"$f":"SUMIF(Arbeitsplan!$G12:$G520,\"<=\"&BU2,Arbeitsplan!$L12:$L520)","v":1080},{"$f":"SUMIF(Arbeitsplan!$G12:$G520,\"<=\"&BV2,Arbeitsplan!$L12:$L520)","v":1080},{"$f":"SUMIF(Arbeitsplan!$G12:$G520,\"<=\"&BW2,Arbeitsplan!$L12:$L520)","v":1080},{"$f":"SUMIF(Arbeitsplan!$G12:$G520,\"<=\"&BX2,Arbeitsplan!$L12:$L520)","v":1080},{"$f":"SUMIF(Arbeitsplan!$G12:$G520,\"<=\"&BY2,Arbeitsplan!$L12:$L520)","v":1080},{"$f":"SUMIF(Arbeitsplan!$G12:$G520,\"<=\"&BZ2,Arbeitsplan!$L12:$L520)","v":1080},{"$f":"SUMIF(Arbeitsplan!$G12:$G520,\"<=\"&CA2,Arbeitsplan!$L12:$L520)","v":1080},{"$f":"SUMIF(Arbeitsplan!$G12:$G520,\"<=\"&CB2,Arbeitsplan!$L12:$L520)","v":1080},{"$f":"SUMIF(Arbeitsplan!$G12:$G520,\"<=\"&CC2,Arbeitsplan!$L12:$L520)","v":1080},{"$f":"SUMIF(Arbeitsplan!$G12:$G520,\"<=\"&CD2,Arbeitsplan!$L12:$L520)","v":1080},{"$f":"SUMIF(Arbeitsplan!$G12:$G520,\"<=\"&CE2,Arbeitsplan!$L12:$L520)","v":1080},{"$f":"SUMIF(Arbeitsplan!$G12:$G520,\"<=\"&CF2,Arbeitsplan!$L12:$L520)","v":1080},{"$f":"SUMIF(Arbeitsplan!$G12:$G520,\"<=\"&CG2,Arbeitsplan!$L12:$L520)","v":1080},{"$f":"SUMIF(Arbeitsplan!$G12:$G520,\"<=\"&CH2,Arbeitsplan!$L12:$L520)","v":1080},{"$f":"SUMIF(Arbeitsplan!$G12:$G520,\"<=\"&CI2,Arbeitsplan!$L12:$L520)","v":1080},{"$f":"SUMIF(Arbeitsplan!$G12:$G520,\"<=\"&CJ2,Arbeitsplan!$L12:$L520)","v":1080},{"$f":"SUMIF(Arbeitsplan!$G12:$G520,\"<=\"&CK2,Arbeitsplan!$L12:$L520)","v":1080},{"$f":"SUMIF(Arbeitsplan!$G12:$G520,\"<=\"&CL2,Arbeitsplan!$L12:$L520)","v":1080},{"$f":"SUMIF(Arbeitsplan!$G12:$G520,\"<=\"&CM2,Arbeitsplan!$L12:$L520)","v":1080},{"$f":"SUMIF(Arbeitsplan!$G12:$G520,\"<=\"&CN2,Arbeitsplan!$L12:$L520)","v":1080},{"$f":"SUMIF(Arbeitsplan!$G12:$G520,\"<=\"&CO2,Arbeitsplan!$L12:$L520)","v":1080},{"$f":"SUMIF(Arbeitsplan!$G12:$G520,\"<=\"&CP2,Arbeitsplan!$L12:$L520)","v":1080},{"$f":"SUMIF(Arbeitsplan!$G12:$G520,\"<=\"&CQ2,Arbeitsplan!$L12:$L520)","v":1080},{"$f":"SUMIF(Arbeitsplan!$G12:$G520,\"<=\"&CR2,Arbeitsplan!$L12:$L520)","v":1080},{"$f":"SUMIF(Arbeitsplan!$G12:$G520,\"<=\"&CS2,Arbeitsplan!$L12:$L520)","v":1080},{"$f":"SUMIF(Arbeitsplan!$G12:$G520,\"<=\"&CT2,Arbeitsplan!$L12:$L520)","v":1080},{"$f":"SUMIF(Arbeitsplan!$G12:$G520,\"<=\"&CU2,Arbeitsplan!$L12:$L520)","v":1080},{"$f":"SUMIF(Arbeitsplan!$G12:$G520,\"<=\"&CV2,Arbeitsplan!$L12:$L520)","v":1080},{"$f":"SUMIF(Arbeitsplan!$G12:$G520,\"<=\"&CW2,Arbeitsplan!$L12:$L520)","v":1080},{"$f":"SUMIF(Arbeitsplan!$G12:$G520,\"<=\"&CX2,Arbeitsplan!$L12:$L520)","v":1080},{"$f":"SUMIF(Arbeitsplan!$G12:$G520,\"<=\"&CY2,Arbeitsplan!$L12:$L520)","v":1080},{"$f":"SUMIF(Arbeitsplan!$G12:$G520,\"<=\"&CZ2,Arbeitsplan!$L12:$L520)","v":1080},{"$f":"SUMIF(Arbeitsplan!$G12:$G520,\"<=\"&DA2,Arbeitsplan!$L12:$L520)","v":1080}]
[{"$f":"SUMIF(Arbeitsplan!$H12:$H520,\"<=\"&A2,Arbeitsplan!$L12:$L520)","v":0},{"$f":"SUMIF(Arbeitsplan!$H12:$H520,\"<=\"&B2,Arbeitsplan!$L12:$L520)","v":0},{"$f":"SUMIF(Arbeitsplan!$H12:$H520,\"<=\"&C2,Arbeitsplan!$L12:$L520)","v":0},{"$f":"SUMIF(Arbeitsplan!$H12:$H520,\"<=\"&D2,Arbeitsplan!$L12:$L520)","v":0},{"$f":"SUMIF(Arbeitsplan!$H12:$H520,\"<=\"&E2,Arbeitsplan!$L12:$L520)","v":0},{"$f":"SUMIF(Arbeitsplan!$H12:$H520,\"<=\"&F2,Arbeitsplan!$L12:$L520)","v":0},{"$f":"SUMIF(Arbeitsplan!$H12:$H520,\"<=\"&G2,Arbeitsplan!$L12:$L520)","v":0},{"$f":"SUMIF(Arbeitsplan!$H12:$H520,\"<=\"&H2,Arbeitsplan!$L12:$L520)","v":0},{"$f":"SUMIF(Arbeitsplan!$H12:$H520,\"<=\"&I2,Arbeitsplan!$L12:$L520)","v":0},{"$f":"SUMIF(Arbeitsplan!$H12:$H520,\"<=\"&J2,Arbeitsplan!$L12:$L520)","v":0},{"$f":"SUMIF(Arbeitsplan!$H12:$H520,\"<=\"&K2,Arbeitsplan!$L12:$L520)","v":0},{"$f":"SUMIF(Arbeitsplan!$H12:$H520,\"<=\"&L2,Arbeitsplan!$L12:$L520)","v":0},{"$f":"SUMIF(Arbeitsplan!$H12:$H520,\"<=\"&M2,Arbeitsplan!$L12:$L520)","v":0},{"$f":"SUMIF(Arbeitsplan!$H12:$H520,\"<=\"&N2,Arbeitsplan!$L12:$L520)","v":0},{"$f":"SUMIF(Arbeitsplan!$H12:$H520,\"<=\"&O2,Arbeitsplan!$L12:$L520)","v":0},{"$f":"SUMIF(Arbeitsplan!$H12:$H520,\"<=\"&P2,Arbeitsplan!$L12:$L520)","v":0},{"$f":"SUMIF(Arbeitsplan!$H12:$H520,\"<=\"&Q2,Arbeitsplan!$L12:$L520)","v":0},{"$f":"SUMIF(Arbeitsplan!$H12:$H520,\"<=\"&R2,Arbeitsplan!$L12:$L520)","v":0},{"$f":"SUMIF(Arbeitsplan!$H12:$H520,\"<=\"&S2,Arbeitsplan!$L12:$L520)","v":0},{"$f":"SUMIF(Arbeitsplan!$H12:$H520,\"<=\"&T2,Arbeitsplan!$L12:$L520)","v":0},{"$f":"SUMIF(Arbeitsplan!$H12:$H520,\"<=\"&U2,Arbeitsplan!$L12:$L520)","v":0},{"$f":"SUMIF(Arbeitsplan!$H12:$H520,\"<=\"&V2,Arbeitsplan!$L12:$L520)","v":0},{"$f":"SUMIF(Arbeitsplan!$H12:$H520,\"<=\"&W2,Arbeitsplan!$L12:$L520)","v":0},{"$f":"SUMIF(Arbeitsplan!$H12:$H520,\"<=\"&X2,Arbeitsplan!$L12:$L520)","v":0},{"$f":"SUMIF(Arbeitsplan!$H12:$H520,\"<=\"&Y2,Arbeitsplan!$L12:$L520)","v":0},{"$f":"SUMIF(Arbeitsplan!$H12:$H520,\"<=\"&Z2,Arbeitsplan!$L12:$L520)","v":0},{"$f":"SUMIF(Arbeitsplan!$H12:$H520,\"<=\"&AA2,Arbeitsplan!$L12:$L520)","v":0},{"$f":"SUMIF(Arbeitsplan!$H12:$H520,\"<=\"&AB2,Arbeitsplan!$L12:$L520)","v":0},{"$f":"SUMIF(Arbeitsplan!$H12:$H520,\"<=\"&AC2,Arbeitsplan!$L12:$L520)","v":0},{"$f":"SUMIF(Arbeitsplan!$H12:$H520,\"<=\"&AD2,Arbeitsplan!$L12:$L520)","v":0},{"$f":"SUMIF(Arbeitsplan!$H12:$H520,\"<=\"&AE2,Arbeitsplan!$L12:$L520)","v":0},{"$f":"SUMIF(Arbeitsplan!$H12:$H520,\"<=\"&AF2,Arbeitsplan!$L12:$L520)","v":0},{"$f":"SUMIF(Arbeitsplan!$H12:$H520,\"<=\"&AG2,Arbeitsplan!$L12:$L520)","v":0},{"$f":"SUMIF(Arbeitsplan!$H12:$H520,\"<=\"&AH2,Arbeitsplan!$L12:$L520)","v":0},{"$f":"SUMIF(Arbeitsplan!$H12:$H520,\"<=\"&AI2,Arbeitsplan!$L12:$L520)","v":0},{"$f":"SUMIF(Arbeitsplan!$H12:$H520,\"<=\"&AJ2,Arbeitsplan!$L12:$L520)","v":90},{"$f":"SUMIF(Arbeitsplan!$H12:$H520,\"<=\"&AK2,Arbeitsplan!$L12:$L520)","v":90},{"$f":"SUMIF(Arbeitsplan!$H12:$H520,\"<=\"&AL2,Arbeitsplan!$L12:$L520)","v":90},{"$f":"SUMIF(Arbeitsplan!$H12:$H520,\"<=\"&AM2,Arbeitsplan!$L12:$L520)","v":90},{"$f":"SUMIF(Arbeitsplan!$H12:$H520,\"<=\"&AN2,Arbeitsplan!$L12:$L520)","v":90},{"$f":"SUMIF(Arbeitsplan!$H12:$H520,\"<=\"&AO2,Arbeitsplan!$L12:$L520)","v":180},{"$f":"SUMIF(Arbeitsplan!$H12:$H520,\"<=\"&AP2,Arbeitsplan!$L12:$L520)","v":180},{"$f":"SUMIF(Arbeitsplan!$H12:$H520,\"<=\"&AQ2,Arbeitsplan!$L12:$L520)","v":180},{"$f":"SUMIF(Arbeitsplan!$H12:$H520,\"<=\"&AR2,Arbeitsplan!$L12:$L520)","v":270},{"$f":"SUMIF(Arbeitsplan!$H12:$H520,\"<=\"&AS2,Arbeitsplan!$L12:$L520)","v":270},{"$f":"SUMIF(Arbeitsplan!$H12:$H520,\"<=\"&AT2,Arbeitsplan!$L12:$L520)","v":270},{"$f":"SUMIF(Arbeitsplan!$H12:$H520,\"<=\"&AU2,Arbeitsplan!$L12:$L520)","v":360},{"$f":"SUMIF(Arbeitsplan!$H12:$H520,\"<=\"&AV2,Arbeitsplan!$L12:$L520)","v":360},{"$f":"SUMIF(Arbeitsplan!$H12:$H520,\"<=\"&AW2,Arbeitsplan!$L12:$L520)","v":360},{"$f":"SUMIF(Arbeitsplan!$H12:$H520,\"<=\"&AX2,Arbeitsplan!$L12:$L520)","v":360},{"$f":"SUMIF(Arbeitsplan!$H12:$H520,\"<=\"&AY2,Arbeitsplan!$L12:$L520)","v":450},{"$f":"SUMIF(Arbeitsplan!$H12:$H520,\"<=\"&AZ2,Arbeitsplan!$L12:$L520)","v":450},{"$f":"SUMIF(Arbeitsplan!$H12:$H520,\"<=\"&BA2,Arbeitsplan!$L12:$L520)","v":540},{"$f":"SUMIF(Arbeitsplan!$H12:$H520,\"<=\"&BB2,Arbeitsplan!$L12:$L520)","v":540},{"$f":"SUMIF(Arbeitsplan!$H12:$H520,\"<=\"&BC2,Arbeitsplan!$L12:$L520)","v":540},{"$f":"SUMIF(Arbeitsplan!$H12:$H520,\"<=\"&BD2,Arbeitsplan!$L12:$L520)","v":540},{"$f":"SUMIF(Arbeitsplan!$H12:$H520,\"<=\"&BE2,Arbeitsplan!$L12:$L520)","v":540},{"$f":"SUMIF(Arbeitsplan!$H12:$H520,\"<=\"&BF2,Arbeitsplan!$L12:$L520)","v":630},{"$f":"SUMIF(Arbeitsplan!$H12:$H520,\"<=\"&BG2,Arbeitsplan!$L12:$L520)","v":630},{"$f":"SUMIF(Arbeitsplan!$H12:$H520,\"<=\"&BH2,Arbeitsplan!$L12:$L520)","v":630},{"$f":"SUMIF(Arbeitsplan!$H12:$H520,\"<=\"&BI2,Arbeitsplan!$L12:$L520)","v":720},{"$f":"SUMIF(Arbeitsplan!$H12:$H520,\"<=\"&BJ2,Arbeitsplan!$L12:$L520)","v":810},{"$f":"SUMIF(Arbeitsplan!$H12:$H520,\"<=\"&BK2,Arbeitsplan!$L12:$L520)","v":810},{"$f":"SUMIF(Arbeitsplan!$H12:$H520,\"<=\"&BL2,Arbeitsplan!$L12:$L520)","v":810},{"$f":"SUMIF(Arbeitsplan!$H12:$H520,\"<=\"&BM2,Arbeitsplan!$L12:$L520)","v":810},{"$f":"SUMIF(Arbeitsplan!$H12:$H520,\"<=\"&BN2,Arbeitsplan!$L12:$L520)","v":810},{"$f":"SUMIF(Arbeitsplan!$H12:$H520,\"<=\"&BO2,Arbeitsplan!$L12:$L520)","v":810},{"$f":"SUMIF(Arbeitsplan!$H12:$H520,\"<=\"&BP2,Arbeitsplan!$L12:$L520)","v":900},{"$f":"SUMIF(Arbeitsplan!$H12:$H520,\"<=\"&BQ2,Arbeitsplan!$L12:$L520)","v":900},{"$f":"SUMIF(Arbeitsplan!$H12:$H520,\"<=\"&BR2,Arbeitsplan!$L12:$L520)","v":990},{"$f":"SUMIF(Arbeitsplan!$H12:$H520,\"<=\"&BS2,Arbeitsplan!$L12:$L520)","v":990},{"$f":"SUMIF(Arbeitsplan!$H12:$H520,\"<=\"&BT2,Arbeitsplan!$L12:$L520)","v":990},{"$f":"SUMIF(Arbeitsplan!$H12:$H520,\"<=\"&BU2,Arbeitsplan!$L12:$L520)","v":990},{"$f":"SUMIF(Arbeitsplan!$H12:$H520,\"<=\"&BV2,Arbeitsplan!$L12:$L520)","v":990},{"$f":"SUMIF(Arbeitsplan!$H12:$H520,\"<=\"&BW2,Arbeitsplan!$L12:$L520)","v":990},{"$f":"SUMIF(Arbeitsplan!$H12:$H520,\"<=\"&BX2,Arbeitsplan!$L12:$L520)","v":990},{"$f":"SUMIF(Arbeitsplan!$H12:$H520,\"<=\"&BY2,Arbeitsplan!$L12:$L520)","v":990},{"$f":"SUMIF(Arbeitsplan!$H12:$H520,\"<=\"&BZ2,Arbeitsplan!$L12:$L520)","v":990},{"$f":"SUMIF(Arbeitsplan!$H12:$H520,\"<=\"&CA2,Arbeitsplan!$L12:$L520)","v":1080},{"$f":"SUMIF(Arbeitsplan!$H12:$H520,\"<=\"&CB2,Arbeitsplan!$L12:$L520)","v":1080},{"$f":"SUMIF(Arbeitsplan!$H12:$H520,\"<=\"&CC2,Arbeitsplan!$L12:$L520)","v":1080},{"$f":"SUMIF(Arbeitsplan!$H12:$H520,\"<=\"&CD2,Arbeitsplan!$L12:$L520)","v":1080},{"$f":"SUMIF(Arbeitsplan!$H12:$H520,\"<=\"&CE2,Arbeitsplan!$L12:$L520)","v":1080},{"$f":"SUMIF(Arbeitsplan!$H12:$H520,\"<=\"&CF2,Arbeitsplan!$L12:$L520)","v":1080},{"$f":"SUMIF(Arbeitsplan!$H12:$H520,\"<=\"&CG2,Arbeitsplan!$L12:$L520)","v":1080},{"$f":"SUMIF(Arbeitsplan!$H12:$H520,\"<=\"&CH2,Arbeitsplan!$L12:$L520)","v":1080},{"$f":"SUMIF(Arbeitsplan!$H12:$H520,\"<=\"&CI2,Arbeitsplan!$L12:$L520)","v":1080},{"$f":"SUMIF(Arbeitsplan!$H12:$H520,\"<=\"&CJ2,Arbeitsplan!$L12:$L520)","v":1080},{"$f":"SUMIF(Arbeitsplan!$H12:$H520,\"<=\"&CK2,Arbeitsplan!$L12:$L520)","v":1080},{"$f":"SUMIF(Arbeitsplan!$H12:$H520,\"<=\"&CL2,Arbeitsplan!$L12:$L520)","v":1080},{"$f":"SUMIF(Arbeitsplan!$H12:$H520,\"<=\"&CM2,Arbeitsplan!$L12:$L520)","v":1080},{"$f":"SUMIF(Arbeitsplan!$H12:$H520,\"<=\"&CN2,Arbeitsplan!$L12:$L520)","v":1080},{"$f":"SUMIF(Arbeitsplan!$H12:$H520,\"<=\"&CO2,Arbeitsplan!$L12:$L520)","v":1080},{"$f":"SUMIF(Arbeitsplan!$H12:$H520,\"<=\"&CP2,Arbeitsplan!$L12:$L520)","v":1080},{"$f":"SUMIF(Arbeitsplan!$H12:$H520,\"<=\"&CQ2,Arbeitsplan!$L12:$L520)","v":1080},{"$f":"SUMIF(Arbeitsplan!$H12:$H520,\"<=\"&CR2,Arbeitsplan!$L12:$L520)","v":1080},{"$f":"SUMIF(Arbeitsplan!$H12:$H520,\"<=\"&CS2,Arbeitsplan!$L12:$L520)","v":1080},{"$f":"SUMIF(Arbeitsplan!$H12:$H520,\"<=\"&CT2,Arbeitsplan!$L12:$L520)","v":1080},{"$f":"SUMIF(Arbeitsplan!$H12:$H520,\"<=\"&CU2,Arbeitsplan!$L12:$L520)","v":1080},{"$f":"SUMIF(Arbeitsplan!$H12:$H520,\"<=\"&CV2,Arbeitsplan!$L12:$L520)","v":1080},{"$f":"SUMIF(Arbeitsplan!$H12:$H520,\"<=\"&CW2,Arbeitsplan!$L12:$L520)","v":1080},{"$f":"SUMIF(Arbeitsplan!$H12:$H520,\"<=\"&CX2,Arbeitsplan!$L12:$L520)","v":1080},{"$f":"SUMIF(Arbeitsplan!$H12:$H520,\"<=\"&CY2,Arbeitsplan!$L12:$L520)","v":1080},{"$f":"SUMIF(Arbeitsplan!$H12:$H520,\"<=\"&CZ2,Arbeitsplan!$L12:$L520)","v":1080},{"$f":"SUMIF(Arbeitsplan!$H12:$H520,\"<=\"&DA2,Arbeitsplan!$L12:$L520)","v":1080}]

{"sheet":"Projekt_1","index":5,"n_rows":21,"n_cols":7,"rows_kept":21,"merged":[[15,0,15,4],[16,0,16,4],[17,0,17,4],[18,0,18,4],[20,0,20,4],[21,0,21,4],[22,0,22,4]]}
[{"$f":"RIGHT(CELL(\"dateiname\"),LEN(CELL(\"dateiname\"))-FIND(\"]\",CELL(\"dateiname\")))","v":"Übersicht"},"Studie","Konzept ","Entwicklung","Pflege",null,{"$f":"HYPERLINK(\"#Übersicht!A1\",\"Zurück zur Übersicht\")","v":"Zurück zur Übersicht"}]
["T min [Monate]",{"v":2,"d":"2.0"},{"v":2,"d":"2.0"},{"v":2,"d":"2.0"},{"v":2,"d":"2.0"}]
["FTE min",{"v":2,"d":"2.0"},{"v":2,"d":"2.0"},{"v":2,"d":"2.0"},{"v":2,"d":"2.0"}]
["Projektleitung",20,20,20,20]
["Entwicklung",40,40,40,40]
["Test",30,30,30,30]
[]
["Summe",{"$f":"SUM(B4:B6)","v":{"v":90,"d":"90.0"}},{"$f":"SUM(C4:C6)","v":{"v":90,"d":"90.0"}},{"$f":"SUM(D4:D6)","v":{"v":90,"d":"90.0"}},{"$f":"SUM(E4:E6)","v":{"v":90,"d":"90.0"}}]
["Fast",{"$f":"B2","v":{"v":2,"d":"2.0"}},{"$f":"C2","v":{"v":2,"d":"2.0"}},{"$f":"D2","v":{"v":2,"d":"2.0"}},{"$f":"E2","v":{"v":2,"d":"2.0"}}]
["Medium",{"$f":"AVERAGE(B9,B11)","v":{"v":2.25,"d":"2.3"}},{"$f":"AVERAGE(C9,C11)","v":{"v":2.25,"d":"2.3"}},{"$f":"AVERAGE(D9,D11)","v":{"v":2.25,"d":"2.3"}},{"$f":"AVERAGE(E9,E11)","v":{"v":2.25,"d":"2.3"}}]
["Slow",{"$f":"IF(B3=0,0,IF(B8/B3/18>B9,B8/B3/18,\"FTEmin!\"))","v":2.5},{"$f":"IF(C3=0,0,IF(C8/C3/18>C9,C8/C3/18,\"FTEmin!\"))","v":2.5},{"$f":"IF(D3=0,0,IF(D8/D3/18>D9,D8/D3/18,\"FTEmin!\"))","v":2.5},{"$f":"IF(E3=0,0,IF(E8/E3/18>E9,E8/E3/18,\"FTEmin!\"))","v":2.5}]
["FTE min",{"$f":"B3","v":{"v":2,"d":"2.0"}},{"$f":"C3","v":{"v":2,"d":"2.0"}},{"$f":"D3","v":{"v":2,"d":"2.0"}},{"$f":"E3","v":{"v":2,"d":"2.0"}}]
["FTE mittel",{"$f":"AVERAGE(B12,B14)","v":{"v":2.25,"d":"2.3"}},{"$f":"AVERAGE(C12,C14)","v":{"v":2.25,"d":"2.3"}},{"$f":"AVERAGE(D12,D14)","v":{"v":2.25,"d":"2.3"}},{"$f":"AVERAGE(E12,E14)","v":{"v":2.25,"d":"2.3"}}]
["FTE max",{"$f":"IF(B2=0,0,B8/B2/18)","v":2.5},{"$f":"IF(C2=0,0,C8/C2/18)","v":2.5},{"$f":"IF(D2=0,0,D8/D2/18)","v":2.5},{"$f":"IF(E2=0,0,E8/E2/18)","v":2.5}]
[]
["Projekt / ggf. Planungsszenario"]
[]
[]
[]
[]
["Projekt offene Fragen"]

{"sheet":"Projekt_2","index":6,"n_rows":21,"n_cols":7,"rows_kept":21,"merged":[[15,0,15,4],[16,0,16,4],[17,0,17,4],[18,0,18,4],[20,0,20,4],[21,0,21,4],[22,0,22,4]]}
[{"$f":"RIGHT(CELL(\"dateiname\"),LEN(CELL(\"dateiname\"))-FIND(\"]\",CELL(\"dateiname\")))","v":"Übersicht"},"Studie","Konzept ","Entwicklung","Pflege",null,{"$f":"HYPERLINK(\"#Übersicht!A1\",\"Zurück zur Übersicht\")","v":"Zurück zur Übersicht"}]
["T min [Monate]",{"v":2,"d":"2.0"},{"v":2,"d":"2.0"},{"v":2,"d":"2.0"},{"v":2,"d":"2.0"}]
["FTE min",{"v":2,"d":"2.0"},{"v":2,"d":"2.0"},{"v":2,"d":"2.0"},{"v":2,"d":"2.0"}]
["Projektleitung",20,20,20,20]
["Entwicklung",40,40,40,40]
["Test",30,30,30,30]
[]
["Summe",{"$f":"SUM(B4:B6)","v":{"v":90,"d":"90.0"}},{"$f":"SUM(C4:C6)","v":{"v":90,"d":"90.0"}},{"$f":"SUM(D4:D6)","v":{"v":90,"d":"90.0"}},{"$f":"SUM(E4:E6)","v":{"v":90,"d":"90.0"}}]
["Fast",{"$f":"B2","v":{"v":2,"d":"2.0"}},{"$f":"C2","v":{"v":2,"d":"2.0"}},{"$f":"D2","v":{"v":2,"d":"2.0"}},{"$f":"E2","v":{"v":2,"d":"2.0"}}]
["Medium",{"$f":"AVERAGE(B9,B11)","v":{"v":2.25,"d":"2.3"}},{"$f":"AVERAGE(C9,C11)","v":{"v":2.25,"d":"2.3"}},{"$f":"AVERAGE(D9,D11)","v":{"v":2.25,"d":"2.3"}},{"$f":"AVERAGE(E9,E11)","v":{"v":2.25,"d":"2.3"}}]
["Slow",{"$f":"IF(B3=0,0,IF(B8/B3/18>B9,B8/B3/18,\"FTEmin!\"))","v":2.5},{"$f":"IF(C3=0,0,IF(C8/C3/18>C9,C8/C3/18,\"FTEmin!\"))","v":2.5},{"$f":"IF(D3=0,0,IF(D8/D3/18>D9,D8/D3/18,\"FTEmin!\"))","v":2.5},{"$f":"IF(E3=0,0,IF(E8/E3/18>E9,E8/E3/18,\"FTEmin!\"))","v":2.5}]
["FTE min",{"$f":"B3","v":{"v":2,"d":"2.0"}},{"$f":"C3","v":{"v":2,"d":"2.0"}},{"$f":"D3","v":{"v":2,"d":"2.0"}},{"$f":"E3","v":{"v":2,"d":"2.0"}}]
["FTE mittel",{"$f":"AVERAGE(B12,B14)","v":{"v":2.25,"d":"2.3"}},{"$f":"AVERAGE(C12,C14)","v":{"v":2.25,"d":"2.3"}},{"$f":"AVERAGE(D12,D14)","v":{"v":2.25,"d":"2.3"}},{"$f":"AVERAGE(E12,E14)","v":{"v":2.25,"d":"2.3"}}]
["FTE max",{"$f":"IF(B2=0,0,B8/B2/18)","v":2.5},{"$f":"IF(C2=0,0,C8/C2/18)","v":2.5},{"$f":"IF(D2=0,0,D8/D2/18)","v":2.5},{"$f":"IF(E2=0,0,E8/E2/18)","v":2.5}]
[]
["Projekt / ggf. Planungsszenario"]
[]
[]
[]
[]
["Projekt offene Fragen"]

{"sheet":"Projekt_3","index":7,"n_rows":21,"n_cols":7,"rows_kept":21,"merged":[[15,0,15,4],[16,0,16,4],[17,0,17,4],[18,0,18,4],[20,0,20,4],[21,0,21,4],[22,0,22,4]]}
[{"$f":"RIGHT(CELL(\"dateiname\"),LEN(CELL(\"dateiname\"))-FIND(\"]\",CELL(\"dateiname\")))","v":"Übersicht"},"Studie","Konzept ","Entwicklung","Pflege",null,{"$f":"HYPERLINK(\"#Übersicht!A1\",\"Zurück zur Übersicht\")","v":"Zurück zur Übersicht"}]
["T min [Monate]",{"v":2,"d":"2.0"},{"v":2,"d":"2.0"},{"v":2,"d":"2.0"},{"v":2,"d":"2.0"}]
["FTE min",{"v":2,"d":"2.0"},{"v":2,"d":"2.0"},{"v":2,"d":"2.0"},{"v":2,"d":"2.0"}]
["Projektleitung",20,20,20,20]
["Entwicklung",40,40,40,40]
["Test",30,30,30,30]
[]
["Summe",{"$f":"SUM(B4:B6)","v":{"v":90,"d":"90.0"}},{"$f":"SUM(C4:C6)","v":{"v":90,"d":"90.0"}},{"$f":"SUM(D4:D6)","v":{"v":90,"d":"90.0"}},{"$f":"SUM(E4:E6)","v":{"v":90,"d":"90.0"}}]
["Fast",{"$f":"B2","v":{"v":2,"d":"2.0"}},{"$f":"C2","v":{"v":2,"d":"2.0"}},{"$f":"D2","v":{"v":2,"d":"2.0"}},{"$f":"E2","v":{"v":2,"d":"2.0"}}]
["Medium",{"$f":"AVERAGE(B9,B11)","v":{"v":2.25,"d":"2.3"}},{"$f":"AVERAGE(C9,C11)","v":{"v":2.25,"d":"2.3"}},{"$f":"AVERAGE(D9,D11)","v":{"v":2.25,"d":"2.3"}},{"$f":"AVERAGE(E9,E11)","v":{"v":2.25,"d":"2.3"}}]
["Slow",{"$f":"IF(B3=0,0,IF(B8/B3/18>B9,B8/B3/18,\"FTEmin!\"))","v":2.5},{"$f":"IF(C3=0,0,IF(C8/C3/18>C9,C8/C3/18,\"FTEmin!\"))","v":2.5},{"$f":"IF(D3=0,0,IF(D8/D3/18>D9,D8/D3/18,\"FTEmin!\"))","v":2.5},{"$f":"IF(E3=0,0,IF(E8/E3/18>E9,E8/E3/18,\"FTEmin!\"))","v":2.5}]
["FTE min",{"$f":"B3","v":{"v":2,"d":"2.0"}},{"$f":"C3","v":{"v":2,"d":"2.0"}},{"$f":"D3","v":{"v":2,"d":"2.0"}},{"$f":"E3","v":{"v":2,"d":"2.0"}}]
["FTE mittel",{"$f":"AVERAGE(B12,B14)","v":{"v":2.25,"d":"2.3"}},{"$f":"AVERAGE(C12,C14)","v":{"v":2.25,"d":"2.3"}},{"$f":"AVERAGE(D12,D14)","v":{"v":2.25,"d":"2.3"}},{"$f":"AVERAGE(E12,E14)","v":{"v":2.25,"d":"2.3"}}]
["FTE max",{"$f":"IF(B2=0,0,B8/B2/18)","v":2.5},{"$f":"IF(C2=0,0,C8/C2/18)","v":2.5},{"$f":"IF(D2=0,0,D8/D2/18)","v":2.5},{"$f":"IF(E2=0,0,E8/E2/18)","v":2.5}]
[]
["Projekt / ggf. Planungsszenario"]
[]
[]
[]
[]
["Projekt offene Fragen"]

{"sheet":"Projekt_4","index":8,"n_rows":21,"n_cols":7,"rows_kept":21,"merged":[[15,0,15,4],[16,0,16,4],[17,0,17,4],[18,0,18,4],[20,0,20,4],[21,0,21,4],[22,0,22,4]]}
[{"$f":"RIGHT(CELL(\"dateiname\"),LEN(CELL(\"dateiname\"))-FIND(\"]\",CELL(\"dateiname\")))","v":"Übersicht"},"Studie","Konzept ","Entwicklung","Pflege",null,{"$f":"HYPERLINK(\"#Übersicht!A1\",\"Zurück zur Übersicht\")","v":"Zurück zur Übersicht"}]
["T min [Monate]",{"v":2,"d":"2.0"},{"v":2,"d":"2.0"},{"v":2,"d":"2.0"},{"v":2,"d":"2.0"}]
["FTE min",{"v":2,"d":"2.0"},{"v":2,"d":"2.0"},{"v":2,"d":"2.0"},{"v":2,"d":"2.0"}]
["Projektleitung",20,20,20,20]
["Entwicklung",40,40,40,40]
["Test",30,30,30,30]
[]
["Summe",{"$f":"SUM(B4:B6)","v":{"v":90,"d":"90.0"}},{"$f":"SUM(C4:C6)","v":{"v":90,"d":"90.0"}},{"$f":"SUM(D4:D6)","v":{"v":90,"d":"90.0"}},{"$f":"SUM(E4:E6)","v":{"v":90,"d":"90.0"}}]
["Fast",{"$f":"B2","v":{"v":2,"d":"2.0"}},{"$f":"C2","v":{"v":2,"d":"2.0"}},{"$f":"D2","v":{"v":2,"d":"2.0"}},{"$f":"E2","v":{"v":2,"d":"2.0"}}]
["Medium",{"$f":"AVERAGE(B9,B11)","v":{"v":2.25,"d":"2.3"}},{"$f":"AVERAGE(C9,C11)","v":{"v":2.25,"d":"2.3"}},{"$f":"AVERAGE(D9,D11)","v":{"v":2.25,"d":"2.3"}},{"$f":"AVERAGE(E9,E11)","v":{"v":2.25,"d":"2.3"}}]
["Slow",{"$f":"IF(B3=0,0,IF(B8/B3/18>B9,B8/B3/18,\"FTEmin!\"))","v":2.5},{"$f":"IF(C3=0,0,IF(C8/C3/18>C9,C8/C3/18,\"FTEmin!\"))","v":2.5},{"$f":"IF(D3=0,0,IF(D8/D3/18>D9,D8/D3/18,\"FTEmin!\"))","v":2.5},{"$f":"IF(E3=0,0,IF(E8/E3/18>E9,E8/E3/18,\"FTEmin!\"))","v":2.5}]
["FTE min",{"$f":"B3","v":{"v":2,"d":"2.0"}},{"$f":"C3","v":{"v":2,"d":"2.0"}},{"$f":"D3","v":{"v":2,"d":"2.0"}},{"$f":"E3","v":{"v":2,"d":"2.0"}}]
["FTE mittel",{"$f":"AVERAGE(B12,B14)","v":{"v":2.25,"d":"2.3"}},{"$f":"AVERAGE(C12,C14)","v":{"v":2.25,"d":"2.3"}},{"$f":"AVERAGE(D12,D14)","v":{"v":2.25,"d":"2.3"}},{"$f":"AVERAGE(E12,E14)","v":{"v":2.25,"d":"2.3"}}]
["FTE max",{"$f":"IF(B2=0,0,B8/B2/18)","v":2.5},{"$f":"IF(C2=0,0,C8/C2/18)","v":2.5},{"$f":"IF(D2=0,0,D8/D2/18)","v":2.5},{"$f":"IF(E2=0,0,E8/E2/18)","v":2.5}]
[]
["Projekt / ggf. Planungsszenario"]
[]
[]
[]
[]
["Projekt offene Fragen"]

{"sheet":"Leer","index":9,"n_rows":21,"n_cols":7,"rows_kept":21,"merged":[[15,0,15,4],[16,0,16,4],[17,0,17,4],[18,0,18,4],[20,0,20,4],[21,0,21,4],[22,0,22,4]]}
[{"$f":"RIGHT(CELL(\"dateiname\"),LEN(CELL(\"dateiname\"))-FIND(\"]\",CELL(\"dateiname\")))","v":"Übersicht"},"Studie","Konzept ","Entwicklung","Pflege",null,{"$f":"HYPERLINK(\"#Übersicht!A1\",\"Zurück zur Übersicht\")","v":"Zurück zur Übersicht"}]
["T min [Monate]"]
["FTE min"]
["Projektleitung"]
["Entwicklung"]
["Test"]
[]
["Summe",{"$f":"SUM(B4:B6)","v":{"v":0,"d":"0.0"}},{"$f":"SUM(C4:C6)","v":{"v":0,"d":"0.0"}},{"$f":"SUM(D4:D6)","v":{"v":0,"d":"0.0"}},{"$f":"SUM(E4:E6)","v":{"v":0,"d":"0.0"}}]
["Fast",{"$f":"B2","v":{"v":0,"d":"0.0"}},{"$f":"C2","v":{"v":0,"d":"0.0"}},{"$f":"D2","v":{"v":0,"d":"0.0"}},{"$f":"E2","v":{"v":0,"d":"0.0"}}]
["Medium",{"$f":"AVERAGE(B9,B11)","v":{"v":0,"d":"0.0"}},{"$f":"AVERAGE(C9,C11)","v":{"v":0,"d":"0.0"}},{"$f":"AVERAGE(D9,D11)","v":{"v":0,"d":"0.0"}},{"$f":"AVERAGE(E9,E11)","v":{"v":0,"d":"0.0"}}]
["Slow",{"$f":"IF(B3=0,0,IF(B8/B3/18>B9,B8/B3/18,\"FTEmin!\"))","v":{"v":0,"d":"0.0"}},{"$f":"IF(C3=0,0,IF(C8/C3/18>C9,C8/C3/18,\"FTEmin!\"))","v":{"v":0,"d":"0.0"}},{"$f":"IF(D3=0,0,IF(D8/D3/18>D9,D8/D3/18,\"FTEmin!\"))","v":{"v":0,"d":"0.0"}},{"$f":"IF(E3=0,0,IF(E8/E3/18>E9,E8/E3/18,\"FTEmin!\"))","v":{"v":0,"d":"0.0"}}]
["FTE min",{"$f":"B3","v":{"v":0,"d":"0.0"}},{"$f":"C3","v":{"v":0,"d":"0.0"}},{"$f":"D3","v":{"v":0,"d":"0.0"}},{"$f":"E3","v":{"v":0,"d":"0.0"}}]
["FTE mittel",{"$f":"AVERAGE(B12,B14)","v":{"v":0,"d":"0.0"}},{"$f":"AVERAGE(C12,C14)","v":{"v":0,"d":"0.0"}},{"$f":"AVERAGE(D12,D14)","v":{"v":0,"d":"0.0"}},{"$f":"AVERAGE(E12,E14)","v":{"v":0,"d":"0.0"}}]
["FTE max",{"$f":"IF(B2=0,0,B8/B2/18)","v":{"v":0,"d":"0.0"}},{"$f":"IF(C2=0,0,C8/C2/18)","v":{"v":0,"d":"0.0"}},{"$f":"IF(D2=0,0,D8/D2/18)","v":{"v":0,"d":"0.0"}},{"$f":"IF(E2=0,0,E8/E2/18)","v":{"v":0,"d":"0.0"}}]
[]
["Projekt / ggf. Planungsszenario"]
[]
[]
[]
[]
["Projekt offene Fragen"]